program: Gaussian 09
title: 000279468
version: EM64L-G09RevD.01
frameworkgroup: C1[X(C14H15Cl2NO4)]
method: RPBEPBE
basis: SDD
operation: Freq
keyword: #p
keyword: freq=noraman
keyword: PBEPBE/SDD
title: #p freq=noraman PBEPBE/SDD
converged: YES YES NO NO
title: Mulliken charges:
elementType: Cl Cl O O O O N C C C C C C C C C C C C C C H H H H H H H H H H H H H H H
charge: -0.057547 -0.051989 -0.342726 -0.244694 -0.431517 -0.255045 -0.152518 -0.329703 -0.332359 -0.581876 -0.571846 0.284873 0.249939 0.441308 -0.291216 -0.379067 -0.391717 -0.239971 -0.243837 -0.227682 0.136679 0.235024 0.269514 0.275646 0.238879 0.258970 0.315610 0.261759 0.298924 0.225414 0.316663 0.227230 0.233303 0.233066 0.234330 0.388174
chargesum: 0.00000
title: Mulliken charges with hydrogens summed into heavy atoms:
elementType: Cl Cl O O O O N C C C C C C C C C C C C C C
charge: -0.057547 -0.051989 -0.342726 -0.244694 -0.043343 -0.255045 -0.152518 0.174835 0.182167 -0.007296 -0.011163 0.284873 0.249939 0.441308 -0.065802 -0.062404 -0.164486 -0.006668 -0.010771 0.006649 0.136679
polarizability: 3.10908818e+02 1.81453701e+01 1.48763367e+02 2.50331644e+01 4.97820731e+00 1.75370188e+02
1716.lowfreq: -0.3919 -0.0010 0.0009 0.0014 4.4253 6.1572 14.0279 25.2482 29.1944
frequency: 13.8798 25.2437 29.1665 31.8885 48.1806 59.1670 76.9147 85.9861 89.2701 106.7147 111.8849 143.8198 151.8696 174.4834 216.3475 226.8355 232.8674 261.3565 287.9917 323.9570 339.6647 369.2368 395.6976 409.8889 416.4966 483.8668 508.7021 544.3267 566.7962 591.7335 616.6299 618.2650 666.8555 681.3726 694.3296 699.4642 718.8895 733.4807 745.5381 773.8095 782.8362 785.5775 793.2596 860.8954 873.1701 928.9351 961.7037 969.4982 988.8824 993.4334 1001.2361 1014.7977 1022.5603 1032.0334 1038.8960 1048.8431 1054.6206 1090.2382 1101.7483 1124.9901 1155.1001 1176.1569 1206.1440 1228.6013 1236.4246 1260.1495 1263.9828 1275.7624 1282.0957 1307.9003 1344.0174 1356.4946 1365.1882 1373.6846 1386.0466 1402.6974 1444.1407 1452.5021 1459.1781 1464.2401 1478.4190 1482.1052 1573.8638 1600.9512 1623.3036 1636.8505 1668.3429 3031.1934 3037.8886 3062.4420 3064.6645 3097.1158 3098.4445 3107.9417 3120.2824 3132.9660 3147.9456 3152.2033 3158.3955 3164.3789 3179.4919 3529.1910
redmass: 7.5371 7.1733 10.0879 12.5469 5.4288 6.9185 3.0052 5.4442 5.3966 4.9964 3.0549 6.0143 7.0729 5.4599 4.4240 8.5171 4.9662 6.0406 5.0540 4.3081 6.2943 3.9894 3.4485 6.2197 3.1410 6.0389 2.8846 4.5233 5.1106 1.6585 3.8449 5.9719 8.4375 7.0386 5.9374 1.9306 5.5489 5.8462 6.3601 1.9524 1.3443 2.1051 1.4511 1.2553 5.1223 1.3500 1.5425 2.9896 6.1222 1.3722 1.4700 4.6713 1.3327 2.1331 1.6873 4.4716 3.7264 2.0250 2.2023 1.4404 1.7581 1.0680 1.1335 2.5864 2.3353 1.2300 1.2004 1.6605 1.3424 1.2740 1.4521 1.2642 1.3428 2.7043 2.1381 2.5765 2.1988 1.0816 1.0911 1.0941 1.1164 2.1369 5.6721 6.4583 7.3497 7.2353 10.2288 1.0606 1.0619 1.0568 1.0581 1.0863 1.1051 1.1028 1.0877 1.0877 1.0935 1.1122 1.1113 1.0992 1.0967 1.0643
irintensity: 0.3377 0.1739 0.0893 0.2965 0.2341 1.1807 1.9268 0.9968 3.8209 2.5232 2.9851 3.2034 1.0171 0.4126 1.1875 1.8687 4.2326 2.8167 3.8156 18.8405 1.9552 11.4497 3.4533 5.1196 2.8736 11.8442 26.3712 37.5767 25.1621 65.4727 63.0184 7.5836 10.3569 44.7630 25.6851 61.2061 61.1182 21.3006 16.7115 37.9841 2.0234 29.5467 0.9919 1.5797 26.7233 6.0865 12.7975 38.3454 7.7752 0.6274 11.6578 159.0183 3.3453 12.8230 40.3063 1.1653 22.7121 415.3345 525.9113 42.1409 286.8750 0.8273 14.2079 80.9289 11.9154 34.1467 13.9343 72.2676 35.6554 17.4328 10.8740 8.9755 32.9422 107.4796 122.6935 57.0190 30.6562 9.8342 5.7992 27.8616 21.7883 14.8202 18.2024 70.8982 80.6643 103.8442 383.9117 9.6591 20.1695 14.2870 15.0265 10.7715 2.5243 6.8212 7.3649 1.7060 29.2292 8.1547 7.3131 19.4841 41.4906 71.5363
temp: 298.150 k
press: 1.00000 atm
elementType: 17 17 8 8 8 8 7 6 6 6 6 6 6 6 6 6 6 6 6 6 6 1 1 1 1 1 1 1 1 1 1 1 1 1 1 1
symmnumber: 1
zpe: 707770.1 jmol-1
zpe.correction: 0.269575 hartree
zpe.thermalcorrener: 0.291007 hartree
zpe.thermalcorrenthalpy: 0.291951 hartree
zpe.thermalcorrgfe: 0.214245 hartree
zpe.sumelectzpe: -1816.699618 hartree
zpe.sumelectthermal: -1816.678186 hartree
zpe.sumelectthermalent: -1816.677242 hartree
zpe.sumelectthermalfe: -1816.754948 hartree
dipole: -1.8059 0.8489 -1.5736
dipole: 2.5413
quadrupole: -127.3134 -157.0055 -126.3566
quadrupole: 6.9983 7.9898 11.5085
quadrupole: 9.5784 -20.1137 10.5352 6.9983 7.9898 11.5085
hfenergy: -1816.969193 hartree
pointgroup: C01 [X(C14H15Cl2N1O4)]
dipole: 0.6960761 -0.3975832 -0.5975195 debye
polarizability: 312.5497242|8.8723486|147.0788539|-25.0292575|-2.3499437|175.4137951 unknown
InChI: InChI=1S/C14H15Cl2NO4/c15-6-8-17(9-7-16)14(20)21-12(13(18)19)10-11-4-2-1-3-5-11/h1-5,10,18H,6-9H2
charge 0 multiplicity 1
36 atoms
Cl -3.670511 -3.821641 -0.775221
Cl -5.820067 3.211519 -0.332204
O  -0.735667 -0.342903 -0.199077
O  -1.418657 1.626687 0.921224
O  -0.542548 -1.05998 2.295012
O  1.668522 -0.418924 2.557023
N  -2.970728 0.211666 -0.134548
C  -3.23104 -1.064271 -0.841147
C  -4.105106 1.08474 0.245473
C  -3.293159 -2.227357 0.163606
C  -4.294943 2.202053 -0.793731
C  -1.707723 0.597363 0.26941
C  0.5808 -0.226991 0.361515
C  3.033416 0.149806 -0.526578
C  1.570533 0.05649 -0.550578
C  3.867127 0.079623 0.631398
C  3.659745 0.340025 -1.799998
C  5.266668 0.184983 0.503953
C  5.057686 0.443093 -1.919634
C  5.870179 0.36405 -0.763415
C  0.671718 -0.54626 1.803403
H  -4.190515 -0.976986 -1.380328
H  -2.437009 -1.256632 -1.578994
H  -3.907559 1.532466 1.23356
H  -5.018691 0.469506 0.314168
H  -4.106615 -2.11133 0.89574
H  -2.328092 -2.380669 0.665438
H  -4.486425 1.811842 -1.80458
H  -3.450481 2.905467 -0.792539
H  1.144041 0.224026 -1.551426
H  3.408256 -0.044719 1.614426
H  3.034295 0.401295 -2.699462
H  5.891879 0.132086 1.402043
H  5.513653 0.585624 -2.905199
H  6.959416 0.446353 -0.849336
H  -0.438295 -1.2087 3.273109
