program: Gaussian 09
title: 000025402
version: EM64L-G09RevD.01
frameworkgroup: C1[X(C7H14)]
method: RPBEPBE
basis: SDD
operation: Freq
keyword: #p
keyword: freq=noraman
keyword: PBEPBE/SDD
title: #p freq=noraman PBEPBE/SDD
converged: YES YES NO NO
title: Mulliken charges:
elementType: C C C C C C C H H H H H H H H H H H H H H
charge: -0.505910 -0.367538 0.465966 -0.686568 -0.824081 -0.339259 -0.731617 0.203797 0.189026 0.212589 0.205147 0.216747 0.210585 0.208294 0.220995 0.219253 0.228836 0.210850 0.223302 0.217331 0.222255
chargesum: 0.00000
title: Mulliken charges with hydrogens summed into heavy atoms:
elementType: C C C C C C C
charge: -0.113087 0.050198 0.465966 -0.050941 -0.154997 -0.128409 -0.068730
polarizability: 9.80601132e+01 8.68301726e+00 7.53416479e+01 -2.96368479e+00 -2.67960085e-01 5.92931010e+01
1716.lowfreq: -22.8071 -16.1993 -9.3992 -0.0007 -0.0003 0.0004 57.9172 74.7372 100.1088
frequency: 57.8423 74.3725 100.0209 113.2362 164.4493 229.2004 277.8423 291.6638 321.1997 386.4703 477.0405 568.4309 741.6610 766.9206 829.6811 869.2053 890.1155 959.9421 1003.8577 1027.4867 1039.4562 1053.8865 1075.4237 1099.5667 1130.0781 1221.8867 1230.6143 1279.1044 1282.8613 1337.0068 1360.0468 1385.4551 1391.1662 1399.1826 1456.7338 1464.9141 1467.7433 1473.3410 1474.4041 1476.0804 1479.5847 1485.7176 1692.6608 2944.2102 2963.4264 2965.8607 2970.2892 2979.7632 3008.0330 3031.7542 3033.5012 3036.0596 3067.5794 3069.3318 3071.1114 3087.2815 3093.6643
redmass: 2.0487 1.8954 1.0829 1.3727 1.6868 1.1138 2.4193 2.7256 2.7570 2.2962 2.6270 2.5143 1.1012 2.4284 1.3184 1.2938 1.7070 1.5686 1.5622 1.4904 1.5311 2.4741 1.8385 2.0754 2.0455 2.1130 1.3477 1.4387 1.1038 1.5370 1.2917 1.2158 1.3722 1.2128 1.0739 1.0487 1.0622 1.0517 1.0574 1.0438 1.0710 1.0800 6.4583 1.0621 1.0381 1.0389 1.0353 1.0597 1.0963 1.0970 1.0969 1.1016 1.0909 1.1000 1.0994 1.0962 1.0946
irintensity: 0.0501 0.0090 1.2990 0.6435 0.2501 0.0545 1.5920 0.3634 0.6700 0.4616 5.1612 5.9557 5.0702 7.7206 21.2330 4.3082 3.3965 3.5247 10.3304 1.6179 0.2670 0.2844 5.9082 8.2404 12.6412 6.1325 0.0432 2.0081 0.1611 0.5658 0.2025 10.3179 6.9963 21.6045 0.9823 9.1972 7.2568 21.7224 1.7102 10.2467 15.3523 16.2378 3.2146 34.0548 62.4587 17.7373 44.5962 35.2235 8.0682 18.4933 47.0152 14.5819 9.5203 76.2488 54.8837 34.6066 63.8695
temp: 298.150 k
press: 1.00000 atm
elementType: 6 6 6 6 6 6 6 1 1 1 1 1 1 1 1 1 1 1 1 1 1
symmnumber: 1
zpe: 497822.5 jmol-1
zpe.correction: 0.189611 hartree
zpe.thermalcorrener: 0.199405 hartree
zpe.thermalcorrenthalpy: 0.200349 hartree
zpe.thermalcorrgfe: 0.154695 hartree
zpe.sumelectzpe: -274.540490 hartree
zpe.sumelectthermal: -274.530696 hartree
zpe.sumelectthermalent: -274.529752 hartree
zpe.sumelectthermalfe: -274.575405 hartree
dipole: 0.0607 0.2195 0.1124
dipole: 0.2539
quadrupole: -44.9827 -44.4252 -47.1420
quadrupole: 0.3274 -0.6285 -0.0690
quadrupole: 0.5339 1.0914 -1.6254 0.3274 -0.6285 -0.0690
hfenergy: -274.7301007 hartree
pointgroup: C01 [X(C7H14)]
dipole: 0.0220035 -0.0753753 -0.0617689 debye
dipolederiv: -0.0610514 -0.0381463 0.0104932 0.010064 0.0982429 -0.0377675 0.0601358 -0.0760728 0.1154959 0.0320541 -0.0045184 -0.0014505 -0.0312247 0.166177 -0.0208834 -0.0928766 -0.0007678 0.0801295 0.1544551 -0.0046616 0.0568834 -0.0272202 0.2254011 0.099564 0.1054877 0.1255807 -0.0949524 -0.0828762 -0.0221119 -0.0193824 -0.0161182 0.0896363 -0.0093911 0.0392342 -0.0167589 0.0693225 -0.0370691 -0.0125044 -0.0320214 -0.0443993 -0.1070378 -0.0806826 -0.043234 -0.0990383 0.0582736 0.1139663 -0.0503692 0.1170105 0.0268876 -0.0278022 0.0884296 0.123051 0.0625096 -0.2327102 -0.142382 0.0122208 -0.0640243 0.0865927 0.0255808 -0.0165298 -0.0710842 -0.020194 0.1100507 0.0334316 -0.0054422 0.0070576 -0.0471727 -0.140986 -0.1208444 -0.0011331 -0.0744997 0.0204514 -0.0238916 0.0548657 -0.0553781 0.0562146 -0.0339659 0.1452259 -0.0665593 0.1101186 -0.0730666 0.0199123 0.0411626 -0.0608952 0.0259709 -0.010785 0.1268969 -0.0287238 0.0994147 -0.0893271 0.0498502 -0.0284639 -0.0089031 -0.0183328 -0.1498962 -0.1153672 -0.0013718 -0.0869926 0.015251 -0.1267027 0.0064245 0.1207296 0.0082964 0.0965358 -0.0189037 0.1585227 -0.0133573 -0.0497701 0.0678527 0.0170131 -0.0014056 -0.0498384 -0.1459944 -0.0982676 -0.0429132 -0.0963378 0.0499288 0.0548452 0.012831 -0.0384034 0.0549894 -0.0227857 0.132952 -0.0974591 0.1196895 -0.064616 -0.1582791 -0.1086412 -0.0411251 -0.0439785 0.0830876 -0.0162658 -0.0318741 -0.0124212 0.0915824 0.0667778 0.0892822 -0.0801381 0.0824971 -0.058612 0.0681364 -0.0679666 0.1301239 -0.0109015 0.0575392 0.0347879 0.1165024 0.0451584 0.0337599 -0.0229936 0.1210201 -0.0747407 -0.0843869 -0.0020072 -0.0716209 -0.0655983 -0.0688263 -0.1051455 -0.094589 -0.0609688 -0.0955039 0.1036585 0.0082185 0.0457939 -0.0303408 0.0446251 -0.011279 0.1318059 -0.1053805 0.1447003 -0.03209 0.0625621 -0.0351419 -0.0190179 -0.1215742 -0.1059817 -0.0852951 -0.0378923 -0.0691616 0.0689686 -0.0872057 0.0672402 0.0894073 0.0273892 0.1018499 -0.0552298 0.1419856 -0.0562906 -0.051292 unknown
polarizability: 97.395104|-9.9158487|75.3298174|1.4853475|3.0396947|59.9699407 unknown
InChI: InChI=1S/C7H14/c1-4-6-7(3)5-2/h5H,4,6H2,1-3H3
charge 0 multiplicity 1
21 atoms
C  0.811917 0.079837 0.622267
C  1.877907 -0.043965 -0.502028
C  -0.618376 -0.196726 0.165876
C  3.30066 0.272671 0.007064
C  -0.885742 -1.606979 -0.333992
C  -1.561194 0.789202 0.224181
C  -3.017467 0.720901 -0.183744
H  0.873495 1.097694 1.055678
H  1.0873 -0.629287 1.433391
H  1.610777 0.644804 -1.327729
H  1.859193 -1.067569 -0.924695
H  4.049047 0.185531 -0.801995
H  3.35753 1.301136 0.411296
H  3.595381 -0.421549 0.817108
H  -1.959533 -1.817611 -0.466151
H  -0.477344 -2.353432 0.375534
H  -0.389191 -1.790275 -1.307324
H  -1.238002 1.768855 0.611381
H  -3.233814 1.448174 -0.991509
H  -3.316667 -0.277042 -0.54593
H  -3.677778 0.985631 0.665621
