program: Gaussian 09
title: 000279305
version: EM64L-G09RevD.01
frameworkgroup: C1[X(C5H7NO2)]
method: RPBEPBE
basis: SDD
operation: Freq
keyword: #pfreq=noraman
keyword: PBEPBE/SDD
title: #p freq=noraman PBEPBE/SDD
converged: NO YES NO NO
title: Mulliken charges:
elementType: O O N C C C C C H H H H H H H
charge: -0.251749 -0.220011 -0.458728 0.252598 0.234950 -0.756222 -0.754785 0.174306 0.333574 0.242004 0.240926 0.242020 0.222422 0.249348 0.249349
chargesum: 0.00000
title: Mulliken charges with hydrogens summed into heavy atoms:
elementType: O O N C C C C C
charge: -0.251749 -0.220011 -0.125155 0.252598 0.234950 -0.031272 -0.033667 0.174306
polarizability: 8.35772349e+01 -1.22297981e+00 7.31723253e+01 -9.09365434e-04 -1.08975349e-03 3.86163740e+01
1716.lowfreq: -13.7792 -0.0001 0.0007 0.0007 6.4104 7.8280 132.1762 157.6774 163.7871
frequency: 132.1734 157.6664 163.7823 211.1087 249.8566 295.5270 330.2353 521.5401 565.8847 595.6833 598.6165 611.4197 687.0387 780.4793 841.0220 931.0829 977.6807 1045.0498 1050.1889 1070.0937 1201.9628 1244.3772 1258.3962 1393.5526 1412.1227 1415.1638 1451.5806 1466.4542 1473.6836 1476.7607 1711.7564 1746.2436 2975.1549 2983.9015 3047.1179 3061.4674 3098.1789 3103.0105 3622.0576
redmass: 1.0265 1.3497 2.2893 3.5794 2.4913 3.7880 5.0702 4.6253 1.2037 3.7992 6.3747 4.5168 11.9299 5.3783 7.6447 2.5804 1.4853 1.3898 1.4600 3.1605 3.9604 4.7332 1.8952 1.5390 1.5967 1.5195 1.0423 1.0420 1.0508 1.0798 7.1361 11.1167 1.0387 1.0370 1.0988 1.0988 1.0977 1.0958 1.0808
irintensity: 0.2012 0.1463 0.3135 4.5921 0.0917 0.5173 2.2982 6.0936 120.3088 12.0784 5.8283 2.2571 17.8850 0.7313 76.3152 17.7182 1.4854 6.2241 0.0819 2.2750 64.4531 52.3913 25.5995 17.4451 1.8431 30.3172 11.1234 15.8839 6.0435 11.9218 114.6673 548.1591 40.4532 26.6396 19.6889 15.0671 17.9230 15.1589 62.8894
temp: 298.150 k
press: 1.00000 atm
elementType: 8 8 7 6 6 6 6 6 1 1 1 1 1 1 1
symmnumber: 1
zpe: 304802.9 jmol-1
zpe.correction: 0.116093 hartree
zpe.thermalcorrener: 0.124094 hartree
zpe.thermalcorrenthalpy: 0.125039 hartree
zpe.thermalcorrgfe: 0.083880 hartree
zpe.sumelectzpe: -399.330186 hartree
zpe.sumelectthermal: -399.322185 hartree
zpe.sumelectthermalent: -399.321241 hartree
zpe.sumelectthermalfe: -399.362399 hartree
dipole: 5.4914 2.8088 -0.0003
dipole: 6.1680
quadrupole: -55.6399 -40.3984 -47.4951
quadrupole: -3.9508 0.0009 0.0004
quadrupole: -7.7954 7.4461 0.3494 -3.9508 0.0009 0.0004
hfenergy: -399.4462792 hartree
pointgroup: C01 [X(C5H7N1O2)]
dipole: -2.189747 -1.0458563 -0.0001368 debye
dipolederiv: -1.0473459 -0.0725516 -0.000046 0.5025504 -0.5723232 0.000043 0.0001341 -0.0000989 -0.1676021 -1.5948108 -0.0103517 0.000136 0.0301938 -0.4195359 0.0000042 -0.0004029 0.0000005 -0.3744259 -0.8848017 0.1365132 -0.0000612 -0.4194509 -0.575505 -0.0000674 0.0000332 0.0000406 -0.3339377 0.4250906 -0.2421962 0.000044 -0.0979241 0.2214497 -0.0000038 -0.0000478 -0.0000958 -0.0601103 0.5417779 0.0621756 0.0000439 0.0618444 0.2953354 0.0000279 -0.0000434 0.0001271 -0.0582602 -0.05004 0.0381142 -0.0000269 -0.0240262 0.0537146 -0.0000058 0.0000027 0.0000467 0.1283199 -0.0605082 0.0074021 -0.0000087 0.0623087 -0.0044028 -0.0000029 0.0000157 -0.000051 0.0994042 2.3083931 0.0966163 -0.0001198 -0.1039388 0.7815816 -0.0000082 0.0002515 0.000001 0.3069986 0.1842343 -0.0161243 0.0000087 0.0050445 0.2216392 0.0000088 0.0000224 0.000028 0.3680505 0.0789173 -0.0293312 0.0332351 -0.0593911 -0.0320442 -0.1022465 -0.0176513 -0.1447436 -0.0424971 -0.0605122 0.0520604 -0.0000606 0.1314294 0.0431857 0.0000662 -0.0000614 0.000032 0.1183126 0.0789077 -0.0294619 -0.0331456 -0.0594557 -0.0319504 0.1021922 0.0177433 0.1447129 -0.0426137 -0.1014807 -0.0426674 -0.0000373 -0.112592 0.0529092 -0.0000327 -0.0000415 -0.000014 0.1180917 0.0910925 0.02487 0.035556 0.041689 -0.01706 0.0911059 -0.0034791 0.1354711 -0.0298188 0.0910863 0.0249324 -0.0355176 0.0417185 -0.0169939 -0.0910809 0.0035244 -0.1354566 -0.0299118 unknown
polarizability: 83.503006|-1.504166|73.2465543|0.0009387|0.0010646|38.616374 unknown
InChI: InChI=1S/C5H7NO2/c1-3-4(2)8-5(7)6-3/h6H,1-2H3
charge 0 multiplicity 1
15 atoms
O  0.625457 1.10367 0.00009
O  2.701874 -0.064689 0.000123
N  0.553932 -1.138584 -0.000021
C  -0.796475 -0.688607 -0.00009
C  -0.746285 0.682038 -0.000032
C  -1.952315 -1.642486 -0.000127
C  -1.772403 1.764242 0.000052
C  1.457724 -0.074089 -0.000162
H  0.859772 -2.10877 0.000079
H  -1.942483 -2.295433 -0.893782
H  -2.905616 -1.089943 -0.000534
H  -1.942964 -2.294965 0.893876
H  -2.788223 1.33463 -0.000161
H  -1.670031 2.410318 -0.891208
H  -1.670264 2.409967 0.891596
