program: Gaussian 09
title: 000279340
version: EM64L-G09RevD.01
frameworkgroup: C1[X(C15H16N2O4S)]
method: RPBEPBE
basis: SDD
operation: Freq
keyword: #p
keyword: freq=noraman
keyword: PBEPBE/SDD
title: #p freq=noraman PBEPBE/SDD
converged: YES YES NO NO
title: Mulliken charges:
elementType: S O O O O N N C C C C C C C C C C C C C C C H H H H H H H H H H H H H H H H
charge: 0.926506 -0.509676 -0.521333 -0.216746 -0.212757 -0.292137 0.020902 0.098460 0.328655 0.299891 -0.441933 0.450555 -0.371640 -0.754793 -0.399406 -0.294741 -0.322042 -0.808022 -0.811107 -0.370755 -0.371431 0.386348 0.293122 0.240641 0.274391 0.284408 0.295211 0.239696 0.272495 0.280167 0.250940 0.243931 0.223071 0.245656 0.226753 0.238123 0.287276 0.291322
chargesum: 0.00000
title: Mulliken charges with hydrogens summed into heavy atoms:
elementType: S O O O O N N C C C C C C C C C C C C C C C
charge: 0.926506 -0.509676 -0.521333 -0.216746 -0.212757 -0.292137 0.020902 0.098460 0.328655 0.299891 -0.148811 0.450555 -0.130999 0.099217 -0.159710 -0.022247 -0.041875 -0.090080 -0.100575 -0.083479 -0.080110 0.386348
polarizability: 3.94772344e+02 -2.97818208e+00 2.68028630e+02 -2.46103018e+00 1.10649777e+00 1.73062405e+02
1716.lowfreq: -18.1494 -7.0419 -0.0015 -0.0008 0.0003 2.2590 5.7123 25.2036 29.7566
frequency: -17.9085 24.9612 29.5193 33.7050 40.5313 52.4702 60.7500 69.8649 98.2933 108.8116 127.0832 131.9671 140.2770 152.3580 168.1962 189.5482 217.1731 247.1064 268.3972 276.3554 305.2453 310.1134 322.2174 352.7728 375.7411 391.5126 416.1097 451.4283 469.2028 480.0656 499.3501 517.9993 557.3845 569.9130 601.6652 627.8512 641.6226 661.6811 705.4877 730.0642 736.6600 762.0781 776.3762 792.2331 823.1311 826.3173 835.3125 852.9102 875.1076 909.5537 936.2115 967.2237 968.1014 978.9540 986.4500 992.1846 994.3902 1004.6559 1012.9184 1042.5159 1052.1987 1094.0944 1117.5219 1118.4540 1159.1764 1180.1328 1212.0072 1221.5460 1227.7667 1280.7361 1294.5446 1300.6862 1305.0524 1349.6492 1366.2644 1381.7213 1385.1418 1397.3481 1402.1738 1414.6357 1420.0596 1434.6467 1450.2929 1463.8576 1465.4444 1476.4343 1478.6037 1490.8309 1562.8709 1566.5834 1593.9586 1604.6416 2980.8820 2984.1758 3035.1404 3062.6591 3063.8186 3092.1488 3096.1612 3122.1368 3144.1057 3149.0366 3166.0872 3177.3860 3181.4484 3184.6634 3190.8094 3194.9955
redmass: 1.0502 4.5113 5.8504 6.2431 1.3250 3.1645 4.8442 5.4125 5.1097 5.3323 3.0070 7.1363 4.6475 2.4131 1.6154 6.5015 4.6260 4.2362 5.2240 4.0528 5.4953 4.5526 3.6452 8.4808 4.4029 5.5860 3.0597 4.5680 3.2348 3.4426 5.9846 4.5026 5.3284 7.0572 5.3636 7.5154 6.4559 4.3050 5.8567 3.9065 4.7496 4.3007 8.5162 12.1322 1.3128 2.1459 2.0681 1.7135 4.2769 1.3604 2.4551 1.3579 1.2758 1.4031 1.4254 1.8308 2.4516 1.5570 1.4290 1.5566 1.5534 3.1559 2.7667 1.3364 1.4530 1.7091 3.0618 3.7642 2.2271 1.7130 3.0436 1.2881 1.1698 6.5602 6.6519 6.3851 2.7583 1.2416 1.2334 1.0582 1.0618 4.7464 1.0810 1.4070 1.5573 1.0588 1.0917 2.9641 6.8626 5.3052 6.2037 6.0834 1.0388 1.0384 1.0245 1.0940 1.0953 1.0999 1.1004 1.0875 1.0952 1.0935 1.0881 1.0891 1.1073 1.0964 1.1075 1.0973
irintensity: 1.4243 0.9045 1.8569 1.0448 0.6048 0.3384 1.0664 0.8369 3.7020 4.5887 1.8245 5.8337 13.7008 8.1134 1.0798 0.6726 0.7290 0.5800 8.0133 1.4818 29.0097 5.1933 0.9982 50.4747 7.7798 4.1181 5.2665 6.1408 12.6719 4.2469 11.2335 22.9148 12.2204 59.6013 9.7579 3.0227 26.8412 25.0404 1.3861 2.0647 5.2889 1.3222 26.8508 49.3724 5.8113 3.2299 44.0159 54.1661 21.4997 5.7469 3.7577 1.6791 40.8994 3.1968 1.3976 2.2087 1.6115 13.7412 1.4479 6.2629 9.4060 23.4403 1.8011 16.3540 56.1958 220.8408 47.8358 474.4486 23.3228 3.7235 17.2778 1.8362 3.5022 61.9154 14.4453 42.5793 3.3789 17.9764 16.6488 17.2984 10.9722 28.1833 18.7750 2.5310 3.1219 16.0838 23.3879 36.1358 5.4214 17.8857 71.2027 8.8903 27.3419 20.1217 0.5855 13.3848 14.4151 11.4797 20.4760 9.1857 29.5497 4.7776 1.4898 1.0255 0.1362 0.8814 0.4449 0.9735
temp: 298.150 k
press: 1.00000 atm
elementType: 16 8 8 8 8 7 7 6 6 6 6 6 6 6 6 6 6 6 6 6 6 6 1 1 1 1 1 1 1 1 1 1 1 1 1 1 1 1
symmnumber: 1
zpe: 739249.2 jmol-1
zpe.correction: 0.281565 hartree
zpe.thermalcorrener: 0.303894 hartree
zpe.thermalcorrenthalpy: 0.304838 hartree
zpe.thermalcorrgfe: 0.227503 hartree
zpe.sumelectzpe: -1387.811174 hartree
zpe.sumelectthermal: -1387.788845 hartree
zpe.sumelectthermalent: -1387.787901 hartree
zpe.sumelectthermalfe: -1387.865236 hartree
dipole: -8.9433 -1.2698 3.9426
dipole: 9.8559
quadrupole: -162.9489 -130.8885 -136.3565
quadrupole: 6.9574 -4.8093 11.8721
quadrupole: -19.5509 12.5094 7.0415 6.9574 -4.8093 11.8721
hfenergy: -1388.0927391 hartree
pointgroup: C01 [X(C15H16N2O4S1)]
dipole: -3.3417244 -0.3022929 1.9435457 debye
polarizability: 388.9446747|-13.5573978|268.6632246|-29.7084864|12.2830871|178.255479 unknown
InChI: InChI=1S/C14H13N2O2.CH3O2S/c1-10-3-4-11(2)14(9-10)15-12-5-7-13(8-6-12)16(17)18;1-4(2)3/h3-9H,1-2H3;1H3
charge 0 multiplicity 1
38 atoms
S  -0.90863 2.536561 -0.464482
O  -1.967131 2.198073 -1.671119
O  0.389979 3.488394 -0.771673
O  5.085548 -2.282868 -1.175785
O  5.857082 -0.166469 -0.795439
N  -0.322544 0.639776 0.672055
N  4.908332 -1.045108 -0.838961
C  -1.477401 -0.185849 0.559694
C  0.934341 0.211079 0.209671
C  -2.252011 -0.402054 1.749012
C  -1.916546 -0.70304 -0.695141
C  -3.108678 -1.451112 -0.807116
C  -3.433792 -1.167353 1.623628
C  -1.91261 3.371364 0.926735
C  -3.859486 -1.678449 0.376071
C  1.194671 -1.146532 -0.180144
C  2.02811 1.139109 0.248767
C  -1.789491 0.111303 3.096998
C  -3.569915 -1.987324 -2.149712
C  2.492963 -1.557791 -0.510164
C  3.320016 0.734655 -0.107827
C  3.544135 -0.611848 -0.483786
H  -1.333719 -0.475016 -1.593854
H  -4.034478 -1.362343 2.51968
H  -1.203783 3.56324 1.742515
H  -2.702125 2.661811 1.207518
H  -2.31653 4.295094 0.48923
H  -4.793068 -2.25093 0.318139
H  0.379897 -1.874916 -0.178783
H  1.843558 2.171144 0.55371
H  -0.972685 -0.517501 3.499804
H  -1.379372 1.132968 3.023831
H  -2.614097 0.10086 3.830093
H  -3.269094 -1.316404 -2.972655
H  -4.667708 -2.097939 -2.184777
H  -3.131172 -2.982598 -2.355502
H  2.712112 -2.591108 -0.791694
H  4.160218 1.43312 -0.091236
