program: Gaussian 09
title: 000279273
version: EM64L-G09RevD.01
frameworkgroup: C1[X(C14H18O)]
method: RPBEPBE
basis: SDD
operation: Freq
keyword: #pfreq=noraman
keyword: PBEPBE/SDD
title: #p freq=noraman PBEPBE/SDD
converged: YES YES NO NO
title: Mulliken charges:
elementType: O C C C C C C C C C C C C C C H H H H H H H H H H H H H H H H H H
charge: -0.451147 -0.166978 -0.171615 -0.068998 -0.249884 -0.537004 -0.493034 -0.451010 -0.442627 0.406563 -0.410478 -0.398492 -0.247536 -0.244217 -0.247450 0.262151 0.228422 0.239195 0.228971 0.214672 0.229414 0.223410 0.213075 0.230359 0.215016 0.196908 0.203856 0.239336 0.234468 0.341909 0.222819 0.222954 0.226972
chargesum: 0.00000
title: Mulliken charges with hydrogens summed into heavy atoms:
elementType: O C C C C C C C C C C C C C C
charge: -0.109237 0.095172 0.056806 0.170197 -0.020913 -0.092918 -0.056549 -0.005634 -0.041863 0.406563 -0.171142 -0.164024 -0.024717 -0.021263 -0.020478
polarizability: 1.76979514e+02 -1.19260950e+00 1.45182751e+02 6.37261624e+00 1.01475095e+01 1.05956041e+02
1716.lowfreq: -28.4696 -18.1609 -0.0006 -0.0002 0.0006 4.5951 33.0457 57.9395 73.4385
frequency: 32.8051 56.8517 72.9377 119.3954 145.2488 185.3163 223.6188 255.0946 272.6806 300.2903 341.0385 390.2684 403.3781 449.6194 459.5277 502.1286 565.4240 616.3835 628.9846 703.7618 727.3371 735.5695 772.0853 803.7262 824.8931 834.8439 851.1148 865.7701 897.4169 917.1100 929.4059 938.2601 952.0571 965.3727 974.0728 975.5910 989.8824 991.8914 1002.4080 1025.6286 1031.5161 1041.5278 1066.0974 1080.0751 1088.8544 1114.3273 1134.6395 1147.3368 1170.5282 1177.5117 1191.2667 1193.7012 1202.0956 1217.3535 1231.6587 1239.7592 1257.4690 1263.1767 1275.3997 1287.5735 1292.5022 1310.7749 1317.0394 1326.7518 1349.2854 1374.3973 1401.5750 1432.8777 1466.6651 1469.4676 1474.5238 1484.9769 1487.7732 1586.9766 1613.0956 2915.0457 2924.0981 2968.9665 2994.2895 2998.3933 3009.4448 3019.9736 3049.8101 3053.3321 3064.8198 3075.7149 3078.9390 3118.2691 3124.3330 3138.2786 3145.2853 3161.4141 3567.9841
redmass: 3.7653 3.9793 4.3583 3.3102 3.3421 2.9622 2.8493 1.9794 1.2241 5.0944 3.5866 2.6660 2.8194 2.9370 2.2897 2.9825 3.3223 6.3615 5.0275 1.9182 3.0545 2.0329 3.3680 1.5667 2.6797 2.3772 1.2551 2.3710 2.6205 1.5198 2.7886 2.2274 2.0797 1.6350 1.5512 3.5371 5.8497 1.3112 1.6342 2.2410 2.1298 1.6749 1.8289 1.6033 1.4749 1.1715 1.3372 1.5425 1.0909 1.4707 1.2151 1.1361 1.2683 1.9109 1.3179 1.4744 1.4156 1.3839 1.7200 1.3651 1.5303 1.4729 1.5074 1.4720 1.4304 6.4394 1.4488 2.2644 1.0800 1.0873 1.0876 2.2258 1.1051 5.9859 6.0664 1.0750 1.0608 1.1053 1.0598 1.0599 1.0629 1.0865 1.0978 1.0932 1.1051 1.1025 1.0921 1.0840 1.0871 1.0916 1.0960 1.1015 1.0665
irintensity: 0.1101 0.0767 3.5965 0.9297 5.8142 7.1680 15.1048 12.1777 110.3960 4.3871 1.2037 0.4298 0.0203 4.0598 3.3611 14.4387 10.3864 0.2021 3.0026 40.2758 8.1829 38.1871 11.0227 3.3644 8.1691 3.3754 0.0152 9.4756 8.1597 2.4019 3.2350 2.6659 4.3033 5.1030 9.5897 52.6628 0.3873 0.1395 12.6239 13.2640 4.7653 7.5476 12.7258 2.6028 6.5056 3.1498 0.6564 5.4154 0.8381 8.5531 4.7600 0.0997 4.2639 0.5475 0.9727 17.5652 8.6872 9.1773 0.7302 2.5033 6.5446 4.3842 1.9619 4.4192 1.6299 0.2437 1.0930 5.7154 1.7847 8.3945 20.4843 21.7262 9.8132 1.6817 14.1626 5.2380 78.2823 46.3054 29.8219 55.9189 59.7488 32.7916 26.1340 32.4984 28.7108 57.9818 47.7008 4.2788 0.3890 23.5524 48.3759 20.7829 1.8298
temp: 298.150 k
press: 1.00000 atm
elementType: 8 6 6 6 6 6 6 6 6 6 6 6 6 6 6 1 1 1 1 1 1 1 1 1 1 1 1 1 1 1 1 1 1
symmnumber: 1
zpe: 747116.5 jmol-1
zpe.correction: 0.284562 hartree
zpe.thermalcorrener: 0.297662 hartree
zpe.thermalcorrenthalpy: 0.298606 hartree
zpe.thermalcorrgfe: 0.244361 hartree
zpe.sumelectzpe: -618.371440 hartree
zpe.sumelectthermal: -618.358340 hartree
zpe.sumelectthermalent: -618.357395 hartree
zpe.sumelectthermalfe: -618.411640 hartree
dipole: -0.1458 0.3864 -1.6971
dipole: 1.7466
quadrupole: -87.5268 -81.8758 -92.2725
quadrupole: -2.0812 5.5869 -1.7454
quadrupole: -0.3018 5.3492 -5.0475 -2.0812 5.5869 -1.7454
hfenergy: -618.6560012 hartree
pointgroup: C01 [X(C14H18O1)]
dipole: -0.0486667 0.1578538 -0.667034 debye
polarizability: 176.7964029|-2.202189|145.1464536|7.1063885|10.2000795|106.1754497 unknown
InChI: InChI=1S/C14H18O/c15-9-13-11-6-7-12(8-11)14(13)10-4-2-1-3-5-10/h1-5,11-15H,6-9H2
charge 0 multiplicity 1
33 atoms
O  -2.771996 2.700035 0.255948
C  -2.516606 -0.326789 0.375964
C  -0.927721 -1.552227 -0.710692
C  -1.389975 0.719037 0.10207
C  -0.326795 -0.103139 -0.73243
C  -2.441005 -1.237671 -0.883762
C  -2.008408 -1.299132 1.47975
C  -0.885869 -2.121166 0.741151
C  -1.880779 1.957291 -0.65424
C  1.135453 0.046351 -0.309926
C  1.61242 1.235859 0.302388
C  2.08049 -0.976754 -0.59207
C  2.979122 1.397647 0.624258
C  3.447173 -0.821388 -0.270708
C  3.905205 0.368893 0.339561
H  -3.487675 0.142573 0.599126
H  -0.490677 -2.223942 -1.46864
H  -0.965283 1.063528 1.063189
H  -0.384856 0.24308 -1.789935
H  -2.674826 -0.716451 -1.830682
H  -3.080681 -2.135118 -0.805758
H  -2.82516 -1.959939 1.824225
H  -1.624681 -0.755763 2.361799
H  0.107266 -1.994537 1.205752
H  -1.114664 -3.202704 0.738464
H  -2.425322 1.654451 -1.576221
H  -1.015449 2.588581 -0.955171
H  0.913811 2.047906 0.533202
H  1.745019 -1.906071 -1.065973
H  -3.106491 3.512765 -0.199505
H  3.319514 2.326499 1.096662
H  4.153983 -1.628439 -0.496257
H  4.965061 0.491935 0.589257
