program: Gaussian 09
title: 000025404
version: EM64L-G09RevD.01
frameworkgroup: C1[X(C15H30O2)]
method: RPBEPBE
basis: SDD
operation: Freq
keyword: #pfreq=noraman
keyword: PBEPBE/SDD
title: #p freq=noraman PBEPBE/SDD
converged: YES YES NO NO
title: Mulliken charges:
elementType: O O C C C C C C C C C C C C C C C H H H H H H H H H H H H H H H H H H H H H H H H H H H H H H
charge: -0.265688 -0.239293 -0.382550 -0.385361 -0.381941 -0.368805 -0.372560 -0.353430 -0.378234 -0.356608 -0.522205 -0.696606 0.237523 -0.367948 -0.262834 -0.345390 -0.686956 0.192365 0.192209 0.196074 0.195807 0.192566 0.192593 0.189800 0.190866 0.189176 0.189064 0.218741 0.213169 0.187888 0.187894 0.194607 0.194610 0.242825 0.244636 0.209755 0.209743 0.214786 0.206619 0.206650 0.220695 0.220232 0.196643 0.196742 0.211858 0.218446 0.211824
chargesum: 0.00000
title: Mulliken charges with hydrogens summed into heavy atoms:
elementType: O O C C C C C C C C C C C C C C C
charge: -0.265688 -0.239293 0.002024 0.006520 0.003219 0.011861 0.005681 0.022353 0.053676 0.032609 -0.034744 -0.062322 0.237523 0.045321 0.178093 0.047995 -0.044827
polarizability: 2.36938411e+02 3.57166196e+00 1.50002245e+02 -3.61230337e-01 3.71322746e-01 1.32839714e+02
1716.lowfreq: -27.7969 -16.2927 -0.0017 0.0015 0.0019 1.6042 5.5008 17.4580 18.9907
frequency: -19.1363 14.6490 18.2203 26.2375 28.1110 49.2019 53.7503 62.2802 80.8088 99.0626 100.9258 103.6234 118.7918 138.9790 143.3277 148.1427 162.0024 180.9633 224.8996 227.2757 238.0823 259.4124 280.8632 348.9741 378.8376 410.3312 459.6465 468.7606 517.2095 548.6050 677.4950 719.9743 721.4831 728.0235 737.1875 748.7547 787.8475 794.6418 840.4368 855.4539 887.0142 901.2116 910.4772 927.0514 930.0967 963.8816 987.1244 1000.3413 1018.7244 1029.2799 1040.6360 1057.1433 1064.5642 1080.2336 1080.7179 1082.4581 1086.4095 1109.5509 1118.5648 1124.3007 1131.4954 1147.2590 1182.6987 1207.0978 1207.7861 1211.2512 1237.8523 1241.0579 1265.4617 1269.2214 1270.2348 1272.9075 1277.7406 1284.9516 1285.6271 1287.5158 1295.8896 1297.2031 1302.1619 1328.3978 1342.6466 1348.0177 1352.6931 1355.8373 1361.9303 1374.0816 1386.7392 1391.8742 1439.0602 1459.7679 1460.1955 1463.4562 1464.3435 1467.4060 1469.2476 1471.2016 1475.0305 1476.2989 1478.9544 1480.5758 1480.8873 1485.8358 1488.6417 1489.4378 1639.9473 2948.5007 2948.9943 2950.6737 2951.9205 2957.0435 2963.1365 2967.8568 2968.3293 2971.0804 2975.7363 2982.0242 2983.6747 2986.0672 2989.6107 2992.2115 2993.9505 2999.7752 3002.2137 3011.5736 3015.6894 3026.9630 3031.9030 3040.6233 3042.3449 3060.9781 3067.6524 3068.7174 3069.9405 3075.9759 3076.9617
redmass: 1.9693 3.1069 3.6175 4.5534 2.4017 1.8885 3.2783 2.8757 1.9825 2.5297 3.0484 2.0231 2.0561 4.5333 1.9841 2.0566 3.7731 2.7176 3.5894 1.1360 1.1350 4.6111 3.8326 3.6347 3.5068 3.0510 3.1674 3.4537 3.4370 2.6875 5.8135 1.0588 1.0764 1.1079 1.0704 1.1641 1.2296 1.1401 1.2769 5.8599 1.9003 1.2710 1.9052 7.2787 1.1639 1.2194 4.8897 4.0618 1.1123 3.7632 3.3713 2.8042 3.1265 2.1469 2.2213 2.2007 2.4959 1.4980 2.5274 2.6086 3.3160 1.4907 1.8423 1.3113 1.5234 1.3451 1.3548 1.3401 1.2435 1.1958 1.2593 1.3393 1.0284 1.1016 1.0822 1.0955 1.0982 1.1178 1.3805 1.4345 1.4270 1.5457 1.7048 1.6363 1.6576 1.6281 1.2168 1.2193 1.0859 1.0736 1.0723 1.0635 1.0759 1.0771 1.0809 1.0694 1.0796 1.0448 1.0422 1.0664 1.0839 1.0918 1.0948 1.0885 9.8162 1.0587 1.0584 1.0589 1.0592 1.0593 1.0588 1.0585 1.0585 1.0365 1.0366 1.0962 1.0619 1.0974 1.0598 1.0983 1.0612 1.0567 1.1022 1.1003 1.1038 1.1016 1.1020 1.1045 1.1036 1.1031 1.1007 1.1043 1.0993 1.0994 1.1045
irintensity: 0.0078 0.0028 0.1089 0.7659 0.0372 0.2833 0.1449 0.1476 0.3277 0.2281 0.4982 0.0237 0.0043 0.1131 0.1647 0.0038 0.6405 7.2956 3.4662 0.0716 0.2486 5.4517 3.5554 2.5272 0.0838 10.5117 0.1825 0.2027 1.7867 1.5229 3.9417 18.6508 1.4255 5.8040 9.1495 0.0261 2.9749 0.7140 0.1289 8.4463 5.7167 2.0431 5.7689 41.4915 0.5028 0.0319 5.7298 5.7457 0.5265 7.6374 28.5564 22.4692 40.9118 9.4720 22.9543 2.9324 15.8610 25.2216 55.5985 11.3330 238.8559 2.5564 0.2149 52.2821 0.0116 0.0244 0.0783 21.4604 0.1896 0.3614 2.7556 25.1701 0.1413 0.3451 0.0308 0.2619 0.0146 0.3047 23.7383 14.5540 0.2328 13.3673 0.3634 1.5789 12.9111 1.2540 11.2154 9.0761 23.1886 0.0605 0.1469 0.0223 0.3573 0.6233 1.3280 0.1622 1.8704 11.8207 12.9921 6.7835 2.3343 2.4495 32.0676 23.1865 170.3469 0.6997 0.9395 6.4328 0.5348 0.2105 63.9987 176.5876 31.9183 37.0816 31.7921 0.3152 4.4850 0.9004 17.3604 2.3756 34.3605 50.9552 0.8687 6.6919 4.2598 0.6517 1.9507 172.3673 2.4441 82.8481 100.8849 0.0510 55.6218 50.0146 134.6537
temp: 298.150 k
press: 1.00000 atm
elementType: 8 8 6 6 6 6 6 6 6 6 6 6 6 6 6 6 6 1 1 1 1 1 1 1 1 1 1 1 1 1 1 1 1 1 1 1 1 1 1 1 1 1 1 1 1 1 1
symmnumber: 1
zpe: 1107341.8 jmol-1
zpe.correction: 0.421764 hartree
zpe.thermalcorrener: 0.443931 hartree
zpe.thermalcorrenthalpy: 0.444875 hartree
zpe.thermalcorrgfe: 0.365391 hartree
zpe.sumelectzpe: -738.636894 hartree
zpe.sumelectthermal: -738.614728 hartree
zpe.sumelectthermalent: -738.613783 hartree
zpe.sumelectthermalfe: -738.693267 hartree
dipole: -0.7684 -1.7154 0.0011
dipole: 1.8796
quadrupole: -95.1710 -115.8218 -105.6162
quadrupole: 3.1693 -0.1515 0.0008
quadrupole: 10.3654 -10.2855 -0.0799 3.1693 -0.1515 0.0008
hfenergy: -739.0586582 hartree
pointgroup: C01 [X(C15H30O2)]
dipole: -0.3010467 0.6739616 -0.0449362 debye
polarizability: 236.9251928|-3.7070949|149.9899949|0.5330174|-0.7643717|132.8651832 unknown
InChI: InChI=1S/C15H30O2/c1-3-5-7-8-9-10-11-12-13-15(16)17-14-6-4-2/h3-14H2,1-2H3
charge 0 multiplicity 1
47 atoms
O  -4.229485 0.256073 0.016052
O  -3.130026 -1.790821 0.194656
C  3.30846 0.481453 0.022316
C  2.045932 -0.409277 0.005152
C  4.626572 -0.324568 -0.011292
C  0.728504 0.397362 0.044287
C  5.889457 0.56607 0.006654
C  7.208308 -0.238946 -0.024675
C  -0.527931 -0.500403 0.029653
C  8.470895 0.652948 -0.004721
C  -1.831124 0.320459 0.071067
C  9.783815 -0.159279 -0.037134
C  -3.082732 -0.542504 0.101063
C  -6.637971 0.59114 -0.044652
C  -5.538031 -0.465649 0.054901
C  -8.048858 -0.043702 -0.010854
C  -9.170799 1.011629 -0.113421
H  3.280827 1.17391 -0.845202
H  3.293879 1.120795 0.930024
H  2.07525 -1.10368 0.870609
H  2.058715 -1.046391 -0.903737
H  4.654399 -1.016983 0.856107
H  4.641992 -0.964088 -0.918707
H  0.718505 1.034336 0.953977
H  0.70025 1.091878 -0.821744
H  5.862348 1.257794 -0.861504
H  5.873158 1.206435 0.913649
H  -0.505391 -1.194854 0.891011
H  -0.52288 -1.138073 -0.875481
H  7.227153 -0.878462 -0.932141
H  7.236756 -0.931388 0.842807
H  8.451062 1.29085 0.902641
H  8.441076 1.345051 -0.871118
H  -1.850684 0.975872 0.965015
H  -1.902015 1.003195 -0.797684
H  9.850768 -0.838139 0.834108
H  9.84199 -0.781155 -0.950531
H  10.670836 0.50064 -0.020432
H  -6.530098 1.309861 0.790529
H  -6.507542 1.16588 -0.981837
H  -5.567916 -1.183023 -0.786513
H  -5.593539 -1.041549 0.997743
H  -8.147193 -0.770592 -0.842619
H  -8.171078 -0.623389 0.926591
H  -9.09085 1.585086 -1.055904
H  -10.170087 0.540302 -0.087753
H  -9.114778 1.732495 0.723744
