program: Gaussian 09
title: 000279260
version: EM64L-G09RevD.01
frameworkgroup: C1[X(C7H6N2O3)]
method: RPBEPBE
basis: SDD
operation: Freq
keyword: #pfreq=noraman
keyword: PBEPBE/SDD
title: #p freq=noraman PBEPBE/SDD
converged: NO NO NO NO
title: Mulliken charges:
elementType: O O O N N C C C C C C C H H H H H H
charge: -0.263862 -0.219039 -0.220018 -0.651169 0.016762 0.302833 0.314155 0.406085 -0.511560 -0.351954 -0.350087 -0.180126 0.289447 0.237188 0.289571 0.194564 0.316746 0.380465
chargesum: 0.00000
title: Mulliken charges with hydrogens summed into heavy atoms:
elementType: O O O N N C C C C C C C
charge: -0.263862 -0.219039 -0.220018 0.046041 0.016762 0.302833 0.314155 0.406085 -0.222112 -0.114766 -0.060516 0.014437
polarizability: 1.82719778e+02 -2.23265828e+00 1.19380616e+02 -2.60458105e-03 2.76877641e-03 3.89393361e+01
1716.lowfreq: -0.0006 0.0003 0.0005 6.1130 6.4257 12.5234 67.6888 105.0653 149.6713
frequency: 67.6884 105.0643 149.6710 175.2505 260.6351 287.9938 323.3612 342.4092 383.5005 420.6488 439.2419 523.7569 524.0374 560.1591 621.8266 685.6396 686.8651 742.0557 745.9650 784.6613 829.4444 842.0333 913.0330 930.3183 983.9258 991.5218 1049.4090 1085.9460 1157.9058 1197.9054 1240.9017 1274.1931 1331.8703 1354.7630 1374.9677 1425.2304 1453.0211 1476.8774 1544.1054 1586.1621 1617.8392 1634.0546 2932.9759 3142.2169 3156.3391 3183.1375 3319.2991 3621.6155
redmass: 12.9858 5.9163 6.1079 9.3589 3.5022 6.1322 3.2065 10.6619 5.3335 4.7455 2.6958 6.5308 2.8334 1.3298 7.7030 5.7196 7.3327 3.1320 5.3952 6.7703 1.3694 1.3549 5.2477 1.4497 1.6466 1.3655 1.6444 2.0503 1.1717 4.3172 4.8932 1.6578 2.0577 9.9873 1.4538 5.6442 6.4192 2.6123 4.5832 7.4109 1.4543 6.5760 1.0876 1.0902 1.0919 1.0953 1.0611 1.0910
irintensity: 0.5910 1.8775 0.6795 6.2587 3.1544 8.9948 20.1468 0.4412 0.4424 0.6545 22.3335 1.6653 0.2610 87.2675 8.2230 38.2598 50.4783 2.4758 8.1418 3.8430 193.8205 0.5829 13.3494 5.3814 20.4493 0.6893 0.7383 43.9180 67.1359 381.3613 221.7461 2.6880 12.9882 80.9352 23.0676 49.5056 11.7607 59.9659 138.6698 67.3727 97.9932 464.2225 69.2451 8.5304 1.8401 3.7222 165.9457 67.0663
temp: 298.150 k
press: 1.00000 atm
elementType: 8 8 8 7 7 6 6 6 6 6 6 6 1 1 1 1 1 1
symmnumber: 1
zpe: 331852.7 jmol-1
zpe.correction: 0.126396 hartree
zpe.thermalcorrener: 0.136304 hartree
zpe.thermalcorrenthalpy: 0.137248 hartree
zpe.thermalcorrgfe: 0.090765 hartree
zpe.sumelectzpe: -604.591922 hartree
zpe.sumelectthermal: -604.582014 hartree
zpe.sumelectthermalent: -604.581070 hartree
zpe.sumelectthermalfe: -604.627553 hartree
dipole: -4.4241 3.4917 0.0024
dipole: 5.6360
quadrupole: -89.9507 -59.6516 -70.0829
quadrupole: -6.6488 0.0059 -0.0018
quadrupole: -16.7223 13.5768 3.1455 -6.6488 0.0059 -0.0018
hfenergy: -604.7183181 hartree
pointgroup: C01 [X(C7H6N2O3)]
dipole: -1.7245499 1.393804 0.0009601 debye
dipolederiv: -1.2452453 -0.4152705 -0.0000428 0.0096961 -0.4384976 0.0000054 -0.0002227 -0.0000994 -0.3502887 -1.0014686 -0.1671296 -0.0000918 -0.3239118 -0.5287836 -0.0002228 0.000708 0.0002678 -0.2406249 -0.6576221 0.1725009 0.0000485 0.4575805 -0.816647 0.0002845 0.000498 -0.0005207 -0.2401483 -1.366297 0.488975 0.0000121 0.3208033 -0.3691728 -0.0000199 -0.000037 -0.0000137 -0.6038609 2.1842685 -0.1928962 -0.0001754 -0.3686086 1.0927794 -0.000005 -0.0008408 0.0001619 0.1884198 -0.9291524 -0.3821805 -0.0000419 -0.0259015 -0.659668 -0.0000303 -0.0001279 -0.0001 -0.0330271 1.3265573 -0.5943074 0.0000119 -0.1859994 0.3166252 0.0000104 0.0000598 -0.0000213 0.1634674 -1.1331498 0.0547201 0.0001664 0.0308683 -0.4590044 -0.0000534 -0.0000469 0.0000259 0.0174935 0.8872466 0.2965155 0.0000265 0.1595993 0.0360807 -0.0000382 -0.0001128 0.0001292 -0.0790817 -0.6564142 0.2779977 0.000009 -0.263842 0.1832087 -0.0000356 -0.0000766 0.0000389 -0.1991799 0.2962767 -0.2541717 0.000025 -0.300662 0.3724993 0.0000336 -0.0001422 -0.0000307 -0.0675904 1.4185545 0.5593052 0.0001211 0.5022191 0.9190615 0.0000562 0.000328 0.0001529 0.1012316 0.1319825 0.0069993 -0.0000108 0.0043462 0.0363366 0.0000102 0.0000154 -0.0000039 0.1652543 0.0420762 0.0782333 0.0000008 0.0355953 -0.0752873 0.0000082 0.000052 0.0000113 0.1655602 0.0876995 -0.0737378 -0.0000197 -0.0165639 0.091788 -0.0000078 0.000013 -0.0000025 0.163915 0.0188144 0.1679298 -0.0000142 0.0162537 -0.1690932 -0.0000111 -0.0000225 -0.0000474 0.116055 0.254935 -0.0603916 -0.0000093 -0.090578 0.1598427 0.0000091 -0.0000064 0.0000048 0.3676411 0.3409382 0.0369086 -0.0000155 0.0391054 0.3079319 0.0000064 -0.0000384 0.0000468 0.3647642 unknown
polarizability: 182.6595533|-2.9657521|119.4408398|-0.0025723|0.0027988|38.9393361 unknown
InChI: InChI=1S/C7H6N2O3/c8-7-2-1-6(9(11)12)3-5(7)4-10/h1-4H,8H2
charge 0 multiplicity 1
18 atoms
O  -3.447368 -1.288855 -0.000465
O  3.543986 0.560202 -0.000736
O  2.880289 -1.628095 -0.000638
N  -2.793304 1.31635 -0.00014
N  2.629727 -0.357307 0.000447
C  -1.15222 -0.491434 -0.000002
C  -1.482733 0.922023 -0.000054
C  1.223018 0.072208 0.000263
C  0.205223 -0.893118 0.000152
C  -0.412909 1.878151 0.000014
C  0.918554 1.463012 0.000165
C  -2.193764 -1.522451 -0.000122
H  0.473997 -1.954997 0.000204
H  -0.653049 2.947209 -0.000046
H  1.741762 2.182571 0.000229
H  -1.82699 -2.574931 -0.000281
H  -3.042564 2.303693 -0.000204
H  -3.513454 0.575866 -0.000185
