program: Gaussian 09
title: 000279242
version: EM64L-G09RevD.01
frameworkgroup: C1[X(C7H8N4O2)]
method: RPBEPBE
basis: SDD
operation: Freq
keyword: #pfreq=noraman
keyword: PBEPBE/SDD
title: #p freq=noraman PBEPBE/SDD
converged: NO YES NO NO
title: Mulliken charges:
elementType: O O N N N N C C C C C C C H H H H H H H H
charge: -0.185233 -0.318663 -0.425059 0.030794 -0.050826 -0.602040 0.201290 -0.076316 0.204196 0.220443 -0.237672 -0.305544 -0.789239 0.386049 0.249544 0.249652 0.242868 0.261022 0.242883 0.362911 0.338941
chargesum: 0.00000
title: Mulliken charges with hydrogens summed into heavy atoms:
elementType: O O N N N N C C C C C C C
charge: -0.185233 -0.318663 -0.039010 0.030794 -0.050826 0.099811 0.201290 -0.076316 0.204196 0.220443 0.011872 -0.055893 -0.042467
polarizability: 1.57871356e+02 6.37709013e+00 1.37254133e+02 -9.51634990e-03 -2.19709670e-03 4.90939962e+01
1716.lowfreq: -13.3717 -0.0006 -0.0006 -0.0003 4.5440 6.4837 9.4001 40.8312 78.2539
frequency: -13.2820 40.7892 78.2396 104.3310 124.8152 141.4077 233.3853 260.5598 301.5316 322.3460 402.5076 428.8666 497.4427 538.0523 543.7081 585.9728 593.4258 595.8229 635.4753 704.1687 717.4020 764.0121 815.5230 854.1543 859.2595 917.4779 946.5605 952.1448 987.5833 1035.6406 1038.2668 1062.2013 1089.0322 1198.6724 1207.1799 1263.5087 1319.8753 1347.9739 1377.0993 1400.8674 1433.0312 1448.3727 1464.4658 1468.3618 1513.3593 1544.5771 1564.3427 1629.3828 1672.6271 2991.8775 3077.9633 3137.6526 3139.9477 3152.4812 3170.1255 3480.7836 3664.4580
redmass: 1.4278 3.2294 3.0180 5.5283 5.0145 6.7682 6.3933 4.9406 4.9973 3.9614 6.6797 4.9750 5.0133 3.8247 5.6211 1.3302 2.8850 4.9744 5.7975 2.7153 1.3442 5.7753 8.6803 1.2625 4.9301 6.8116 1.3521 1.2091 1.9146 1.6842 4.2111 2.0932 2.6497 2.9573 2.8117 6.8905 2.3035 2.0822 1.2315 3.7553 2.5625 1.2179 1.0463 2.7197 5.7984 2.1161 1.7772 4.2221 3.4873 1.0378 1.0979 1.0894 1.0991 1.0831 1.0978 1.0475 1.1018
irintensity: 2.7777 0.0686 7.2080 2.8449 9.4838 0.4058 7.9881 7.2956 5.4629 0.7417 0.4575 0.0226 16.8384 0.3260 5.7653 126.8881 22.4731 24.2193 9.4495 0.0517 156.9491 9.8065 2.4893 24.8623 0.2286 10.6979 37.8638 62.2479 43.3754 17.1435 9.2920 1.5653 7.4314 102.9274 97.8390 169.2008 76.8308 11.4290 65.1542 103.0976 21.9519 161.2525 18.6841 212.3924 19.3411 207.1163 853.0546 112.9160 64.9495 3.7412 12.1295 13.6878 15.6382 267.9968 29.4037 63.8390 85.2765
temp: 298.150 k
press: 1.00000 atm
elementType: 8 8 7 7 7 7 6 6 6 6 6 6 6 1 1 1 1 1 1 1 1
symmnumber: 1
zpe: 405779.8 jmol-1
zpe.correction: 0.154553 hartree
zpe.thermalcorrener: 0.165653 hartree
zpe.thermalcorrenthalpy: 0.166597 hartree
zpe.thermalcorrgfe: 0.116634 hartree
zpe.sumelectzpe: -640.083171 hartree
zpe.sumelectthermal: -640.072072 hartree
zpe.sumelectthermalent: -640.071127 hartree
zpe.sumelectthermalfe: -640.121091 hartree
dipole: 4.5467 -1.7875 0.0014
dipole: 4.8855
quadrupole: -68.0372 -72.6796 -76.0284
quadrupole: 8.7036 -0.0150 0.0098
quadrupole: 4.2112 -0.4312 -3.7800 8.7036 -0.0150 0.0098
hfenergy: -640.2377246 hartree
pointgroup: C01 [X(C7H8N4O2)]
dipole: 1.8114458 0.6427086 0.0005134 debye
dipolederiv: -0.9314254 -0.0400339 0.0001378 -0.548047 -0.6815839 0.0003559 -0.0000803 0.00019 -0.3009326 -0.9173711 0.0354628 -0.0003516 0.1635967 -0.8543932 -0.0002768 -0.0002963 -0.0004567 -0.3666283 -2.4156364 0.3421729 0.0003862 0.3522418 -0.5895276 -0.0000267 0.000463 -0.0000015 -0.3299346 -0.3355092 0.0109603 -0.0000351 0.6242209 -0.3360355 0.0000194 0.0009901 -0.0003315 -0.240469 -0.2623402 -0.2808865 -0.0004226 -0.0553967 0.1572364 0.0005137 -0.0000608 0.0003279 -0.2255055 -1.195245 -0.3279084 -0.000712 -0.4327546 -0.5435473 -0.0002549 -0.0009139 -0.0002133 -0.6410543 1.3296281 -0.5857536 -0.0006217 -1.0072584 0.3090499 0.0001541 -0.0007211 -0.000035 0.2512277 -0.4466536 0.4848668 0.0005244 -0.3614626 -0.3885433 -0.0007284 -0.0004336 -0.0001706 0.0456002 2.4424498 -0.2058449 -0.0004857 0.4313048 0.9730389 -0.0005343 0.0000019 -0.0003285 0.1798902 1.5335887 0.2158741 0.0012111 0.3411537 1.2738659 0.00118 0.001517 0.0012932 0.2192387 0.3268943 0.402178 0.0006818 -0.1847523 0.3972118 0.00055 -0.0003575 0.0009312 0.0095768 0.0158961 -0.4762048 -0.0004563 -0.0604045 -0.3625513 -0.0005526 -0.0002086 -0.0009437 -0.0525337 -0.2070172 0.1759287 0.0000244 0.3188696 -0.3375985 0.0000157 -0.0000113 0.0001006 0.0439752 0.4083912 0.116606 0.0002524 0.257668 0.3851882 0.0001515 -0.0000678 0.0001065 0.2945503 0.0996456 -0.0154126 -0.0000296 0.0345536 -0.103371 -0.0003248 0.0001332 -0.0003061 0.1237201 -0.0225446 0.1143164 0.0000062 0.0697084 0.011284 -0.0001224 0.0000379 -0.0000611 0.1554058 0.0772036 -0.0199449 -0.0742522 -0.0004421 0.0441553 -0.0753882 -0.0389136 -0.0976752 -0.0236323 -0.0916061 -0.0046008 -0.0000227 -0.0708874 0.0835754 0.0000004 -0.0000259 0.0000195 0.1297206 0.0770791 -0.0198974 0.0742774 -0.000484 0.0441376 0.0753808 0.0389655 0.0976674 -0.0236084 0.2896355 0.0512185 -0.0000094 0.0617279 0.3160673 0.0000213 0.0000412 0.0000352 0.3638293 0.2249367 0.0269034 -0.0001029 0.0668441 0.202341 -0.0001337 -0.0000591 -0.0001483 0.3875639 unknown
polarizability: 157.4193614|-7.0556439|137.7060261|0.0254475|0.0904971|49.0940976 unknown
InChI: InChI=1S/C7H8N4O2/c1-4(12)11-7-5(6(8)13)9-2-3-10-7/h2-3,11H,8H2,1H3
charge 0 multiplicity 1
21 atoms
O  -3.132157 -1.039253 0.000643
O  0.427761 2.501288 0.002484
N  -1.263516 0.42921 0.000051
N  -0.30974 -1.777562 -0.002743
N  2.283599 -0.612904 0.00057
N  2.712809 2.025802 0.003858
C  -0.156827 -0.412615 -0.000592
C  1.166227 0.170124 0.000816
C  -2.651006 0.118121 0.000439
C  1.397243 1.657519 0.002483
C  0.820636 -2.528397 -0.002975
C  2.121352 -1.962109 -0.001174
C  -3.507299 1.385757 0.000232
H  -0.984953 1.436513 0.000937
H  0.678798 -3.614774 -0.00475
H  3.022714 -2.58072 -0.001243
H  -3.297573 2.003301 0.892874
H  -4.568083 1.098117 0.000102
H  -3.297289 2.003257 -0.892365
H  3.415781 1.281674 0.003678
H  2.963323 3.012349 0.004975
