program: Gaussian 09
title: 000279265
version: EM64L-G09RevD.01
frameworkgroup: C1[X(C17H19NO2)]
method: RPBEPBE
basis: SDD
operation: Freq
keyword: #p
keyword: freq=noraman
keyword: PBEPBE/SDD
title: #p freq=noraman PBEPBE/SDD
converged: YES YES NO NO
title: Mulliken charges:
elementType: O O N C C C C C C C C C C C C C C C C C H H H H H H H H H H H H H H H H H H H
charge: -0.282858 -0.279638 -0.351443 -0.547843 0.474502 -0.366487 -0.403219 -0.411569 0.360172 -0.386265 -0.344755 -0.412544 0.423253 -0.384715 -0.419786 0.232752 -0.218464 -0.223502 -0.239440 -0.779288 0.213292 0.225873 0.261022 0.219825 0.246726 0.232195 0.250501 0.248559 0.319378 0.223525 0.220338 0.261298 0.228163 0.227164 0.227358 0.229581 0.262456 0.232901 0.230985
chargesum: 0.00000
title: Mulliken charges with hydrogens summed into heavy atoms:
elementType: O O N C C C C C C C C C C C C C C C C C
charge: -0.282858 -0.279638 -0.032065 -0.108678 0.474502 0.114359 -0.156493 -0.179374 0.360172 -0.135765 -0.096196 0.031318 0.423253 -0.123417 -0.191623 0.232752 0.008701 0.003856 -0.009859 -0.052946
polarizability: 2.91022695e+02 -1.90401417e+01 1.61389746e+02 1.87949359e+01 2.82424640e+01 1.41526273e+02
1716.lowfreq: -96.2971 -13.2058 -2.3905 -0.0008 -0.0005 0.0005 3.3639 14.4778 16.8119
frequency: -96.2964 13.3153 14.6672 21.5160 33.5391 37.9271 61.9454 83.3574 96.1627 116.8931 160.5575 196.1271 225.7123 261.0385 280.5607 314.8414 355.3670 402.0626 412.5634 415.7790 439.7582 453.1410 484.9900 489.7185 547.1782 570.7957 589.8792 597.5502 607.6935 617.3493 633.9320 701.6063 718.8242 729.4434 745.6275 796.1771 805.8237 818.2387 832.4595 841.2948 855.8936 904.6790 912.6763 937.7137 959.3244 967.1461 976.6176 979.3697 983.4847 989.9973 996.1812 1003.9182 1012.6094 1027.9480 1031.0527 1035.3380 1085.8609 1105.3244 1117.7549 1172.6515 1177.9122 1186.0685 1186.5979 1202.1815 1211.5242 1220.7914 1228.4367 1232.1727 1265.2445 1306.0628 1314.5523 1319.5596 1354.1773 1358.2157 1373.8260 1380.9681 1390.9274 1416.3780 1440.9676 1445.3564 1457.3269 1466.6928 1468.2083 1469.8588 1486.4398 1493.9832 1502.5851 1581.0807 1596.6190 1618.9727 1622.2659 1628.6036 2934.6631 2987.3009 2989.2764 2992.9501 2993.5845 3056.2404 3075.0997 3075.3762 3114.5465 3120.2492 3126.2369 3128.6210 3134.3875 3142.3461 3158.9742 3160.5148 3164.1803 3171.3052 3541.6160
redmass: 1.0581 5.2901 3.9631 5.3296 3.9917 4.8251 4.5368 3.9788 3.9942 3.8528 4.9950 5.7252 3.3622 3.2468 2.9092 4.8982 2.4669 2.8294 2.9631 3.1374 2.9196 3.5415 3.4867 3.9251 2.3573 1.9837 4.0657 2.0908 2.6775 6.2482 6.5818 2.2603 3.4641 2.7858 1.6171 2.4588 3.0744 1.4525 3.9938 1.7787 1.2506 2.9300 1.3366 1.3578 1.5767 1.5531 3.4235 1.4269 3.1817 6.1255 1.3484 2.5902 1.7349 2.1385 1.7377 1.7876 1.5637 3.4006 1.3717 1.0538 1.2815 1.1377 1.1690 1.2081 1.9622 2.5138 2.5995 1.4932 1.8514 1.3109 1.3834 1.3269 1.5827 1.4039 1.2639 4.7545 3.8511 3.2716 2.1501 1.1547 1.0742 1.1113 1.0473 1.1486 2.3219 1.7838 2.3217 6.9480 6.2169 6.0955 6.4274 6.1388 1.0572 1.0644 1.0382 1.0612 1.1033 1.1002 1.0985 1.0993 1.0876 1.0892 1.0891 1.0867 1.0983 1.0927 1.0969 1.0938 1.0953 1.0986 1.0774
irintensity: 0.0326 1.6194 0.9895 2.1265 2.0569 7.9004 1.0194 4.2605 4.6450 0.8657 4.6546 1.4282 5.3537 3.5545 4.1548 1.3615 0.4035 0.7500 0.2106 10.2515 0.0032 8.6122 3.1216 17.7240 3.4367 109.2446 2.7292 37.2456 15.3169 0.7141 0.9756 30.8051 17.5576 10.4642 62.9485 10.8708 17.5541 7.7560 8.9282 46.7093 0.2794 3.1760 5.3141 0.0382 1.4262 3.3859 83.8869 4.1188 12.8578 0.1701 0.7172 9.2163 2.6695 9.4516 12.6072 12.2064 8.6588 17.0246 14.8094 0.5338 77.8374 26.0217 14.9881 4.3896 45.1392 87.9163 149.6267 35.0990 121.7950 0.3581 11.1475 13.2015 20.9039 1.4086 48.1766 17.5539 14.7955 1.9031 15.5018 121.2841 9.7043 10.1310 19.6066 66.7486 3.0161 260.2291 90.0055 11.1424 0.8633 10.3045 37.2132 242.9580 28.7606 32.2235 9.8803 38.0983 29.2573 22.9265 10.7007 15.1171 10.0098 16.8902 22.1434 0.7860 11.2020 28.0429 33.7322 17.0315 3.5100 9.9591 20.8187
temp: 298.150 k
press: 1.00000 atm
elementType: 8 8 7 6 6 6 6 6 6 6 6 6 6 6 6 6 6 6 6 6 1 1 1 1 1 1 1 1 1 1 1 1 1 1 1 1 1 1 1
symmnumber: 1
zpe: 837702.9 jmol-1
zpe.correction: 0.319064 hartree
zpe.thermalcorrener: 0.337630 hartree
zpe.thermalcorrenthalpy: 0.338574 hartree
zpe.thermalcorrgfe: 0.267027 hartree
zpe.sumelectzpe: -862.960951 hartree
zpe.sumelectthermal: -862.942386 hartree
zpe.sumelectthermalent: -862.941442 hartree
zpe.sumelectthermalfe: -863.012989 hartree
dipole: -4.5784 -0.6596 -1.4194
dipole: 4.8385
quadrupole: -150.0223 -109.1584 -114.5516
quadrupole: 0.5832 1.1363 5.9167
quadrupole: -25.4449 15.4190 10.0259 0.5832 1.1363 5.9167
hfenergy: -863.2800157 hartree
pointgroup: C01 [X(C17H19N1O2)]
dipole: 1.7950917 0.015572 -0.6333742 debye
polarizability: 290.7872869|-25.2901556|137.7234779|-10.9587986|-26.3304814|165.4279498 unknown
InChI: InChI=1S/C17H19NO2/c1-14(19)18-12-11-15-7-9-17(10-8-15)20-13-16-5-3-2-4-6-16/h2-10,18H,11-13H2,1H3
charge 0 multiplicity 1
39 atoms
O  1.7402 0.030825 0.237881
O  -6.870441 -0.669863 0.146898
N  -4.624937 -0.614878 -0.474005
C  -3.786424 1.704298 0.058351
C  -2.317247 1.311524 0.101953
C  -4.630315 0.795255 -0.883592
C  -1.820526 0.43536 1.106518
C  -1.406595 1.767186 -0.882642
C  0.419034 0.495663 0.128129
C  -0.472732 0.028682 1.124986
C  -0.049295 1.371672 -0.882947
C  2.72132 0.529827 -0.739165
C  4.085914 -0.029896 -0.385387
C  4.43335 -0.322093 0.956079
C  5.047754 -0.221882 -1.407792
C  -5.75027 -1.254077 0.031556
C  5.727809 -0.793901 1.268684
C  6.345116 -0.685519 -1.09397
C  6.689374 -0.972703 0.247009
C  -5.52692 -2.713931 0.4328
H  -3.894789 2.745926 -0.301313
H  -4.230109 1.659609 1.06991
H  -5.685691 1.118353 -0.872478
H  -4.247597 0.88114 -1.919434
H  -2.49758 0.082572 1.893787
H  -1.758328 2.45166 -1.664918
H  -0.08807 -0.639694 1.901676
H  0.619513 1.750505 -1.661317
H  -3.737715 -1.121263 -0.507506
H  2.732194 1.640954 -0.699567
H  2.426813 0.223647 -1.764182
H  3.681286 -0.193142 1.740125
H  4.784834 -0.012136 -2.452592
H  5.986149 -1.022313 2.308914
H  7.080632 -0.830047 -1.89321
H  7.693322 -1.337044 0.491824
H  -6.479344 -3.132311 0.788773
H  -5.169662 -3.314489 -0.42376
H  -4.777628 -2.793772 1.242222
