program: Gaussian 09
title: 000279241
version: EM64L-G09RevD.01
frameworkgroup: C1[X(C7H12N4O2)]
method: RPBEPBE
basis: SDD
operation: Freq
keyword: #p
keyword: freq=noraman
keyword: PBEPBE/SDD
title: #p freq=noraman PBEPBE/SDD
converged: YES YES NO NO
title: Mulliken charges:
elementType: O O N N N N C C C C C C C H H H H H H H H H H H H
charge: -0.225212 -0.254858 -0.348605 -0.362005 -0.379506 -0.387825 -0.097101 -0.126300 -0.032701 -0.414227 0.122225 -0.725591 0.163137 0.256474 0.267834 0.218282 0.192176 0.217114 0.258028 0.304573 0.336511 0.215882 0.232235 0.210290 0.359172
chargesum: 0.00000
title: Mulliken charges with hydrogens summed into heavy atoms:
elementType: O O N N N N C C C C C C C
charge: -0.225212 -0.254858 -0.090577 -0.057432 -0.042996 -0.028653 0.159373 0.141534 0.185581 -0.004937 0.122225 -0.067184 0.163137
polarizability: 1.34307360e+02 5.00175374e+00 1.14799961e+02 -6.15311474e-01 -1.75649700e+00 6.91754803e+01
1716.lowfreq: -9.5897 -5.4511 -0.0005 0.0007 0.0008 5.6123 82.1318 86.2384 140.5612
frequency: 82.1281 86.2116 140.5527 173.4167 196.3153 212.1559 232.3029 296.6384 330.5732 368.0408 390.7092 402.3954 448.2168 469.2623 486.7542 518.2997 532.7871 575.5215 622.1356 659.1531 686.7405 711.6749 735.8123 754.9554 841.9997 892.7517 931.9709 954.8811 996.4694 1009.8498 1054.5386 1086.0018 1105.0403 1122.7484 1155.9147 1183.7316 1191.7985 1220.9595 1236.5532 1258.0610 1289.8129 1306.2260 1315.4157 1332.8910 1356.9065 1360.3401 1372.1931 1374.2557 1390.0497 1405.8313 1425.8739 1457.0689 1460.6635 1478.3058 1481.9020 1646.0788 1678.8897 2825.2585 2861.5891 2876.5058 2900.7036 2981.7984 3058.4084 3072.7946 3091.6187 3393.5322 3500.0073 3528.8776 3574.1059
redmass: 4.8375 3.8666 5.0075 3.8623 3.4775 1.1670 2.8577 3.7229 5.0562 3.2265 5.0357 3.5275 2.3235 2.7965 1.5597 4.0556 2.8698 2.4878 2.1546 3.3793 3.1276 2.4039 3.6994 1.8434 2.4310 2.2567 1.9717 2.1211 2.4895 4.5730 2.2117 2.2454 2.4163 2.3977 3.4809 2.0093 2.2549 1.4891 1.9167 1.6598 1.2866 1.4505 1.2442 1.5788 1.5599 1.5173 3.0650 1.7512 1.2739 1.5002 1.4323 1.2288 1.1352 1.0540 1.1820 8.8130 5.7293 1.0757 1.0831 1.0708 1.0816 1.0364 1.0908 1.0983 1.1000 1.0740 1.0762 1.0770 1.0780
irintensity: 0.4094 0.3846 0.7694 3.0017 2.7074 0.4591 0.3768 5.0142 10.3069 15.8651 18.8584 26.4087 6.8305 4.7867 61.8376 10.4082 43.3479 32.3247 75.3789 31.6498 27.3221 25.1836 15.0712 159.3790 10.3880 13.9219 3.0910 0.9021 10.3662 0.1759 22.7821 4.1663 15.6201 14.0283 43.8882 23.3192 22.8139 41.3935 74.1459 75.7552 78.4380 3.7147 46.5490 42.5933 26.8246 53.2840 128.1605 36.5692 34.1664 19.5379 1.8663 5.7378 4.8151 7.2622 21.9965 250.3755 588.6780 41.0799 72.6670 54.8085 117.6462 30.2680 28.0936 34.5016 35.2090 1.8990 13.2201 57.6201 43.3712
temp: 298.150 k
press: 1.00000 atm
elementType: 8 8 7 7 7 7 6 6 6 6 6 6 6 1 1 1 1 1 1 1 1 1 1 1 1
symmnumber: 1
zpe: 533258.9 jmol-1
zpe.correction: 0.203108 hartree
zpe.thermalcorrener: 0.214774 hartree
zpe.thermalcorrenthalpy: 0.215718 hartree
zpe.thermalcorrgfe: 0.165966 hartree
zpe.sumelectzpe: -642.419088 hartree
zpe.sumelectthermal: -642.407422 hartree
zpe.sumelectthermalent: -642.406477 hartree
zpe.sumelectthermalfe: -642.456229 hartree
dipole: 4.8872 -1.2988 -0.4712
dipole: 5.0788
quadrupole: -81.8021 -82.5949 -77.9217
quadrupole: -4.7935 0.4617 4.8885
quadrupole: -1.0292 -1.8220 2.8512 -4.7935 0.4617 4.8885
hfenergy: -642.6221953 hartree
pointgroup: C01 [X(C7H12N4O2)]
dipole: -1.9120325 0.5435952 -0.2029625 debye
dipolederiv: -0.5975345 0.1230748 0.0224293 -0.0368119 -1.1835863 0.0050816 0.040087 -0.0322701 -0.3448018 -1.1792198 -0.3280225 -0.0819308 -0.4164735 -0.8326019 -0.0373258 -0.1167004 -0.03803 -0.3946655 -0.7859531 -0.0388479 -0.0036651 -0.0096676 -0.3253665 -0.1703656 0.0079802 -0.2154373 -0.4322012 -0.6378184 -0.022748 0.0144741 0.0074069 -0.3877254 -0.0967093 0.0124793 -0.1283153 -0.576971 -1.2819761 0.1007144 -0.0725627 0.163848 -0.4392535 0.07254 0.0158157 0.0373925 -0.458269 -0.6509629 -0.5041676 0.0124281 -0.2707712 -1.3955507 0.0042723 0.0554036 0.0145844 -0.3601348 0.8578733 0.0133085 0.0213287 0.0174655 0.3201671 0.1043324 0.0419161 0.067197 0.5300397 0.0658452 0.243434 0.1109377 0.4268723 0.0951011 0.0535161 0.1939367 -0.002223 0.349828 0.4879532 0.1022306 0.0651222 0.3090046 0.2153862 0.0613806 0.0478302 0.0611073 0.323529 0.4654968 -0.0503829 -0.090591 -0.2440773 0.1527524 0.0940777 -0.098641 0.050144 0.3859712 1.0763076 0.3807667 -0.1351141 0.150484 1.561475 -0.006666 -0.1823668 0.0032688 0.2336475 -0.0842645 0.0331981 0.0375615 0.0581258 0.0386087 -0.0126405 0.0100071 -0.0163764 0.0630652 1.8895816 0.065257 0.1716689 0.1451802 1.711241 0.0349251 0.1373694 0.0858498 0.3204062 -0.1133142 0.0049849 0.0027035 -0.0024285 -0.0042094 -0.0622136 0.0508406 -0.0518385 -0.2048962 -0.0219356 -0.021117 0.008938 -0.0657104 0.0116201 -0.067232 -0.1243446 -0.0445186 -0.1624596 -0.0479704 -0.0112802 0.0312975 -0.0746866 -0.0055107 -0.0502148 -0.080203 -0.0538868 -0.2324788 -0.0219993 0.0200247 0.0009048 0.0961051 0.0326512 -0.072569 0.1379389 -0.0084796 -0.2394127 -0.1026725 -0.0926486 -0.0246111 -0.1132377 -0.0030865 -0.0214593 -0.052502 -0.0578268 0.0663869 0.1090272 0.0041167 -0.0039016 0.0061102 0.0271944 0.0982688 -0.012981 0.2078811 0.192597 0.1449831 0.0565406 -0.0098859 -0.0248921 0.1197444 0.0467326 -0.0219843 0.1395571 0.2901044 0.1514955 0.0072481 -0.0257748 -0.0265537 0.1798434 -0.0204909 -0.0411269 -0.0182875 0.3236535 -0.0956482 -0.0745053 -0.0237966 -0.1457386 0.0110999 -0.0382351 -0.0386645 -0.0387262 0.0879353 0.0954683 0.0008067 -0.0457672 0.0145405 0.0850534 -0.016615 0.0356266 -0.0503415 -0.1303236 0.0753547 0.0052359 0.0093569 0.0808788 -0.1270415 0.1000972 -0.0094724 0.1139888 0.0331673 0.2018831 -0.0172216 0.0084496 -0.0449727 0.1419943 -0.0024873 -0.0082449 -0.0244132 0.3362831 unknown
polarizability: 134.490674|4.632624|114.6705347|0.7016183|0.6831981|69.1215928 unknown
InChI: InChI=1S/C7H12N4O2/c1-3-2-8-4-5(9-3)10-7(13)11-6(4)12/h3-5,8-11H,2H2,1H3
charge 0 multiplicity 1
25 atoms
O  1.533979 -2.581147 -0.027413
O  3.298314 1.735072 0.195799
N  -1.439972 1.248757 -0.026156
N  -1.124574 -1.570202 -0.067391
N  0.973995 1.495232 -0.008538
N  2.375471 -0.403384 -0.082093
C  -0.154558 0.636178 -0.410794
C  -0.022143 -0.709455 0.334837
C  -2.615167 0.372459 -0.347388
C  -2.422391 -1.003626 0.336606
C  1.338992 -1.339293 0.044879
C  -3.902305 1.068184 0.1200
C  2.270255 1.021038 0.046568
H  -0.09485 0.421593 -1.508023
H  -0.038046 -0.449898 1.427252
H  -2.670587 0.176779 -1.445426
H  -2.506884 -0.856483 1.441793
H  -3.231935 -1.680028 0.010897
H  -1.563014 2.177579 -0.460627
H  -0.963209 -2.56648 0.114057
H  0.840056 2.493714 0.153434
H  -4.785882 0.444236 -0.105331
H  -3.866399 1.254382 1.207969
H  -4.041916 2.040192 -0.389953
H  3.332469 -0.760497 -0.163859
