program: Gaussian 09
title: 000279287
version: EM64L-G09RevD.01
frameworkgroup: C1[X(C18H23NO2S)]
method: RPBEPBE
basis: SDD
operation: Freq
keyword: #p
keyword: freq=noraman
keyword: PBEPBE/SDD
title: #p freq=noraman PBEPBE/SDD
converged: YES YES NO NO
title: Mulliken charges:
elementType: S O O N C C C C C C C C C C C C C C C C C C H H H H H H H H H H H H H H H H H H H H H H H
charge: 0.900092 -0.534649 -0.535573 -0.217496 -0.121318 -0.117602 -0.371614 -0.374888 0.360904 -0.466652 -0.467375 -0.563703 -0.575610 0.114262 -0.788217 -0.788303 0.034520 -0.252218 -0.273318 -0.204334 -0.203809 -0.219241 0.273460 0.266664 0.251707 0.252334 0.212011 0.229850 0.230201 0.211804 0.290021 0.259509 0.261554 0.304010 0.219672 0.222233 0.231416 0.222855 0.219201 0.230977 0.277242 0.284274 0.239406 0.239541 0.236199
chargesum: 0.00000
title: Mulliken charges with hydrogens summed into heavy atoms:
elementType: S O O N C C C C C C C C C C C C C C C C C C
charge: 0.900092 -0.534649 -0.535573 -0.217496 0.152143 0.149061 -0.119907 -0.122554 0.360904 -0.024791 -0.025370 -0.014173 -0.010046 0.114262 -0.114897 -0.115270 0.034520 0.025025 0.010956 0.035071 0.035733 0.016958
polarizability: 2.78863470e+02 1.13035466e+01 2.04021827e+02 -3.60736766e+00 3.20961695e+00 2.01431034e+02
1716.lowfreq: -8.4557 -5.4234 0.0010 0.0011 0.0014 1.0565 8.0855 26.5865 32.7093
frequency: -3.7337 26.4729 32.6730 55.0010 62.1025 74.4200 106.8197 133.4223 141.8989 173.1132 187.6348 188.6791 202.0634 209.1557 237.4337 245.0270 262.8301 271.9220 326.5200 330.5499 352.3019 385.0517 394.4370 403.7103 407.5530 423.5953 459.5201 461.4601 503.1805 535.7695 555.2953 603.2319 655.3508 674.8050 682.7454 690.1042 695.8610 737.3636 759.6761 788.9206 792.5261 819.8247 849.2611 850.6335 851.4753 860.5563 882.5295 915.1350 917.5201 932.7124 933.1085 945.4258 952.1769 973.0510 975.9962 979.4876 982.6817 1001.6070 1003.7618 1009.3393 1013.0890 1028.4113 1041.0453 1042.6969 1050.1539 1076.3488 1079.9788 1088.5205 1097.7673 1117.4285 1146.8344 1168.1910 1172.8176 1173.0628 1176.6786 1184.3612 1196.6911 1215.2235 1240.3466 1242.3636 1243.9226 1272.7249 1277.1087 1288.0668 1296.4459 1301.4996 1303.4096 1320.4520 1324.2609 1336.4049 1383.9504 1387.0850 1398.3683 1424.9747 1432.1739 1436.4933 1453.5829 1457.8415 1465.5902 1466.9465 1472.8883 1474.8799 1481.5295 1579.2795 1605.3786 1735.8106 2958.4306 2962.3143 2986.4719 2991.2476 2997.9653 3011.9739 3026.1304 3028.6156 3029.3489 3044.5338 3053.2789 3067.3275 3070.8006 3073.6744 3078.8483 3079.7728 3091.0014 3093.8584 3136.3253 3147.3124 3156.9458 3165.7079 3174.7798
redmass: 4.5115 4.6828 4.0209 4.4786 4.4191 5.4311 2.4587 1.0496 6.0463 1.6120 2.8390 2.5868 2.5990 3.3867 6.2541 8.5910 2.2058 3.4488 4.4521 4.3804 2.3448 3.0138 4.8903 2.8640 3.5793 3.7292 3.4452 3.5573 4.7112 3.7805 4.0548 6.4781 6.3124 2.5572 5.4451 2.4121 3.5903 4.4060 1.4356 5.1325 4.4352 1.8468 3.6505 1.3490 3.0384 2.5144 2.6186 2.7699 16.0667 1.7392 1.5383 1.7479 1.5716 1.8401 1.4861 5.0474 1.4081 2.5942 1.3381 3.8979 2.3760 2.3056 2.0193 2.2347 2.1715 1.5446 1.6366 3.4210 1.4515 3.2552 1.3300 1.3140 1.5002 1.0616 1.1267 1.5859 1.2104 1.3966 1.3060 1.7239 2.2859 1.3286 1.4648 1.2430 1.3972 1.3312 1.3521 1.4110 1.4280 1.3869 8.4800 1.2561 1.2109 1.0772 1.0815 2.2305 2.0498 1.0495 1.0808 1.0490 1.0467 1.0737 1.0877 5.8734 6.9635 8.2809 1.0385 1.0384 1.0628 1.0651 1.0581 1.0616 1.0972 1.0965 1.0859 1.0876 1.1043 1.0889 1.0986 1.0948 1.1005 1.1004 1.0958 1.0958 1.0856 1.0885 1.0927 1.0967 1.1015
irintensity: 1.0806 0.8036 0.2248 0.8461 1.5902 0.8354 0.0750 0.1058 1.3888 1.7768 2.7911 1.1204 5.6854 0.5686 0.2462 9.3058 0.0889 12.7645 0.1979 5.7836 11.5136 31.6967 10.3612 0.0613 0.7998 13.8918 21.3712 24.8808 80.6800 14.9273 0.3452 0.0071 0.4001 2.6960 40.7893 32.9596 12.9179 0.2928 78.1224 48.0142 21.4724 26.6305 28.1254 2.8647 5.4193 0.3690 2.1819 3.9702 64.2268 5.1134 2.9743 0.0794 0.1586 19.9832 4.1937 0.6041 0.0329 0.4109 0.3303 3.4931 6.3273 0.9777 0.4809 4.4434 21.8851 6.0894 1.6069 2.4146 11.7829 0.1153 17.8293 0.4024 7.9922 0.0206 7.6340 8.4202 1.9137 3.4164 25.7733 3.8620 3.3537 0.9087 4.4737 7.9891 3.6357 7.0031 0.4162 0.0399 0.4281 9.9708 4.3880 27.3288 7.7696 33.4277 5.8685 12.8706 18.1917 0.3439 4.0857 10.5301 23.9414 14.8555 4.0597 6.6553 0.5280 2.6740 22.6601 81.7930 7.3237 11.9068 30.6175 78.9929 0.0722 53.8451 4.6866 22.9265 2.6467 44.2628 2.8462 3.0723 49.4079 30.8873 38.3348 25.4744 0.8122 10.9241 2.4589 5.0274 30.8679
temp: 298.150 k
press: 1.00000 atm
elementType: 16 8 8 7 6 6 6 6 6 6 6 6 6 6 6 6 6 6 6 6 6 6 1 1 1 1 1 1 1 1 1 1 1 1 1 1 1 1 1 1 1 1 1 1 1
symmnumber: 1
zpe: 971763.8 jmol-1
zpe.correction: 0.370125 hartree
zpe.thermalcorrener: 0.390486 hartree
zpe.thermalcorrenthalpy: 0.391430 hartree
zpe.thermalcorrgfe: 0.320869 hartree
zpe.sumelectzpe: -1301.138809 hartree
zpe.sumelectthermal: -1301.118449 hartree
zpe.sumelectthermalent: -1301.117505 hartree
zpe.sumelectthermalfe: -1301.188066 hartree
dipole: -0.5559 4.4851 -0.4381
dipole: 4.5406
quadrupole: -116.6428 -146.4711 -134.3121
quadrupole: 12.7750 -1.9401 1.2138
quadrupole: 15.8325 -13.9958 -1.8368 12.7750 -1.9401 1.2138
hfenergy: -1301.5089347 hartree
pointgroup: C01 [X(C18H23N1O2S1)]
dipole: 0.2075654 1.7501324 0.2918653 debye
polarizability: 279.9974486|-6.9715343|201.0517041|-1.5868568|3.6212219|203.2671776 unknown
InChI: InChI=1S/C18H23NO2S/c1-12(2)18-14-8-9-15(18)17-11-19(10-16(14)17)22(20,21)13-6-4-3-5-7-13/h3-7,14-17H,8-11H2,1-2H3
charge 0 multiplicity 1
45 atoms
S  1.616319 -1.578819 -0.327572
O  1.387774 -2.033733 -1.885752
O  1.388613 -2.624564 0.9118
N  0.566105 0.048881 0.056276
C  -1.57599 -0.409206 -1.102166
C  -1.712442 -0.853646 0.415779
C  -2.860062 0.453059 -1.333674
C  -3.055793 -0.187643 0.859074
C  -3.029147 1.111242 0.042259
C  -4.084709 -0.518556 -1.352971
C  -4.219543 -0.959356 0.155384
C  -0.240843 0.38045 -1.167993
C  -0.44364 -0.295092 1.11435
C  -3.122459 2.415454 0.415902
C  -3.294183 2.849221 1.864403
C  -3.073045 3.565234 -0.579745
C  3.382859 -0.927995 -0.196982
C  3.978698 -0.886901 1.073323
C  4.033315 -0.551403 -1.382074
C  5.310682 -0.419326 1.156303
C  5.365421 -0.086557 -1.277989
C  5.997415 -0.016709 -0.014066
H  -1.535107 -1.276496 -1.783701
H  -1.751693 -1.952095 0.521866
H  -2.800887 1.114068 -2.212474
H  -3.171527 -0.102495 1.950822
H  -3.915629 -1.374832 -2.030912
H  -4.99319 0.009034 -1.693856
H  -5.195818 -0.653417 0.57142
H  -4.122488 -2.0523 0.287007
H  0.343069 0.162916 -2.077901
H  -0.415605 1.472795 -1.105326
H  -0.653251 0.662682 1.630494
H  -0.00027 -1.002359 1.835997
H  -2.461974 3.510805 2.178516
H  -4.226058 3.43627 1.989586
H  -3.334406 1.99572 2.560636
H  -4.007858 4.159565 -0.539399
H  -2.246953 4.26244 -0.334252
H  -2.933959 3.221191 -1.617578
H  3.430141 -1.228948 1.956538
H  3.523539 -0.643254 -2.346576
H  5.809339 -0.375439 2.13016
H  5.906253 0.213254 -2.181682
H  7.029688 0.342662 0.058147
