program: Gaussian 09
title: 000279232
version: EM64L-G09RevD.01
frameworkgroup: C1[X(C10H10N4)]
method: RPBEPBE
basis: SDD
operation: Freq
keyword: #pfreq=noraman
keyword: PBEPBE/SDD
title: #p freq=noraman PBEPBE/SDD
converged: YES YES NO NO
title: Mulliken charges:
elementType: N N N N C C C C C C C C C C H H H H H H H H H H
charge: -0.481547 -0.065184 -0.030937 -0.643123 0.457686 0.138478 -0.457981 -0.340485 0.032534 -0.199375 -0.219961 -0.260682 -0.270795 -0.280522 0.310678 0.215201 0.312785 0.223881 0.223077 0.227167 0.238111 0.238778 0.328369 0.303848
chargesum: 0.00000
title: Mulliken charges with hydrogens summed into heavy atoms:
elementType: N N N N C C C C C C C C C C
charge: -0.170868 -0.065184 -0.030937 -0.010907 0.457686 0.138478 -0.242780 -0.027700 0.032534 0.024506 0.003115 -0.033515 -0.032684 -0.041744
polarizability: 2.33711683e+02 -1.03172714e+01 1.52374800e+02 -1.84089327e+00 -2.56955286e+00 5.55127393e+01
1716.lowfreq: -12.9479 0.0004 0.0007 0.0008 1.5651 10.0722 43.1786 57.2518 112.2537
frequency: 42.7744 57.2499 112.2515 144.5745 217.5000 231.5222 296.4228 317.1634 377.0681 408.3136 419.7788 473.2987 510.1636 562.3865 567.1507 579.0764 611.5836 621.9283 646.1655 656.5321 696.0164 763.9977 767.5514 803.6297 826.1327 831.2716 838.1069 907.0691 910.8784 914.8878 968.1920 983.2659 997.9566 1001.2425 1026.3823 1070.7540 1090.1715 1151.4667 1170.4012 1186.5822 1238.7362 1271.3389 1287.5990 1321.3602 1353.3080 1381.7864 1420.9317 1434.9815 1453.6678 1486.9776 1501.2979 1521.5650 1555.7906 1599.9461 1614.5093 1625.2930 3102.7355 3129.6162 3141.6492 3145.0768 3164.0855 3173.1993 3192.8340 3493.4382 3508.8081 3632.7048
redmass: 4.0503 5.4120 4.9040 5.0301 4.4052 3.9851 5.1546 4.2571 1.1763 2.9608 3.8899 4.9052 2.8234 6.4782 3.1862 6.3679 4.0930 3.3427 1.5184 1.5770 1.9617 1.7145 9.0236 5.6087 1.9220 2.0395 1.3191 6.3226 1.4280 1.4085 1.3516 5.6308 1.3351 2.0042 2.0828 2.2199 1.6364 2.2920 1.0540 1.1125 2.3904 3.0312 1.9229 1.4633 2.8389 5.5230 2.2021 2.2768 3.9825 2.1943 3.2719 7.1632 3.3989 3.9995 4.2036 1.3251 1.0887 1.0865 1.0932 1.0876 1.0997 1.0996 1.0951 1.0451 1.0749 1.1012
irintensity: 0.1824 0.1704 0.5263 0.6899 1.5088 2.7352 3.5152 14.6391 60.0345 0.3292 8.0452 11.7896 23.4158 2.5775 9.4439 1.5001 28.8498 37.8810 209.3251 33.7263 55.3558 95.0332 1.8308 7.9658 18.8428 25.6098 2.7017 8.5004 11.2330 0.5260 0.1381 2.1139 2.2494 5.4620 9.2044 0.7944 12.7205 24.1394 0.3174 4.7436 18.1589 44.3665 3.5852 16.6090 23.8258 25.0178 11.8252 9.8588 226.5727 100.8735 208.0297 173.1822 254.5456 63.7274 112.3138 117.9779 17.1141 0.3506 32.5728 1.6146 30.1701 43.9927 10.3945 30.2362 22.5167 29.5693
temp: 298.150 k
press: 1.00000 atm
elementType: 7 7 7 7 6 6 6 6 6 6 6 6 6 6 1 1 1 1 1 1 1 1 1 1
symmnumber: 1
zpe: 493531.9 jmol-1
zpe.correction: 0.187976 hartree
zpe.thermalcorrener: 0.199347 hartree
zpe.thermalcorrenthalpy: 0.200291 hartree
zpe.thermalcorrgfe: 0.150006 hartree
zpe.sumelectzpe: -605.086352 hartree
zpe.sumelectthermal: -605.074981 hartree
zpe.sumelectthermalent: -605.074037 hartree
zpe.sumelectthermalfe: -605.124322 hartree
dipole: -0.2605 2.5020 0.7596
dipole: 2.6277
quadrupole: -80.5963 -66.6542 -86.7082
quadrupole: -0.5940 1.4888 1.4559
quadrupole: -2.6101 11.3320 -8.7220 -0.5940 1.4888 1.4559
hfenergy: -605.2743281 hartree
pointgroup: C01 [X(C10H10N4)]
dipole: -0.1379789 1.0080511 0.1832308 debye
dipolederiv: -2.177023 0.1125992 -0.0460327 0.1630426 -0.2994661 -0.0743318 -0.086886 -0.084139 -0.308613 -0.3615934 -0.1882773 -0.0069273 0.5111482 -0.1455619 0.0279769 -0.1577737 0.003868 -0.2503008 -0.0306417 0.224276 0.0136233 -0.607126 -0.3715225 -0.0193919 -0.0355545 -0.0951167 -0.2612602 -0.2136067 0.1268427 -0.1762539 -0.0994241 -1.3359633 0.080754 -0.0885646 0.2805852 -0.5518188 1.5385496 0.1819619 -0.0101006 0.6453485 0.0946265 0.0161154 -0.0732367 -0.0010573 0.0913176 1.6998585 -0.6142709 0.1037715 -0.8097448 -0.1098516 -0.0172295 0.3021737 0.0205196 0.1978037 -0.4402078 -0.0643918 0.0183018 0.126712 0.0408564 -0.0703268 -0.0529707 -0.0837319 -0.2015032 -0.3266889 -0.0025847 -0.003335 -0.3373749 -0.1186929 -0.0289428 0.0939952 -0.0035615 -0.1687641 -0.5645896 0.1551906 0.0209223 -0.0111392 1.4115178 0.0194615 0.0691145 0.0417475 0.1420016 0.1607384 0.0167385 0.001046 -0.0703412 0.1067242 -0.0744326 0.0368425 -0.0710922 -0.1166869 0.1362325 -0.0163445 0.0185096 0.097397 0.1513033 -0.0851655 -0.0193962 -0.0791569 -0.1172601 -0.1354759 0.0629462 -0.0135078 0.026777 -0.1598222 -0.0070587 -0.0059654 -0.0094545 -0.1963598 -0.0858807 0.2891197 -0.0052832 -0.3633453 0.2064629 -0.052457 0.0455259 -0.0185233 -0.0869333 0.19161 -0.3037231 -0.0251107 0.5499169 0.0125316 0.0093564 -0.0063821 -0.0022389 -0.0978951 0.1679904 -0.0029115 0.0012279 -0.0261833 0.1529259 0.0505534 -0.060817 0.0663802 0.2715629 0.0592097 -0.0939305 0.0230489 -0.0619584 -0.0926687 0.0760507 0.0069507 0.0711554 0.1442817 0.1732159 0.0588545 -0.0248387 0.0588373 0.0713704 0.0295409 -0.0292254 0.020486 0.1636167 -0.0517758 0.100009 -0.0357818 0.122323 -0.0016096 0.0507978 -0.041786 0.0503474 0.1405409 0.0599775 -0.0340789 0.0093718 -0.0764734 -0.0949918 0.0717661 0.0208646 0.0692211 0.1310473 -0.1319332 -0.0612844 0.0093177 -0.0658158 0.0765704 0.0261451 0.0076876 0.0253675 0.1633199 0.07354 0.0015546 0.000533 0.0879899 -0.1087412 0.0200853 0.0046297 0.0201911 0.1532891 -0.0776073 0.1153754 0.006011 0.0727277 0.0428139 0.0015404 -0.0037445 0.0083855 0.15772 0.1418879 -0.017627 0.0246849 0.0469495 0.225346 -0.0348363 -0.0294734 -0.0776459 0.3339441 0.1942138 -0.0460437 0.096802 0.0197566 0.2458423 -0.0159709 0.1039916 -0.1525362 0.26695 unknown
polarizability: 234.3121394|-7.5279357|149.9160446|1.2619574|-13.5795803|57.3710386 unknown
InChI: InChI=1S/C10H10N4/c11-9-10(13-7-6-12-9)14-8-4-2-1-3-5-8/h1-7,14H,11H2
charge 0 multiplicity 1
24 atoms
N  -0.09303 0.777302 -0.115833
N  1.231044 -1.219523 0.147742
N  3.566288 0.399518 0.022676
N  2.23263 2.351422 0.039546
C  -1.417982 0.271962 -0.039961
C  1.136259 0.129479 0.035713
C  -2.471953 1.180211 -0.345725
C  -1.734716 -1.060989 0.339305
C  2.332695 0.953286 0.04674
C  -3.816146 0.767404 -0.268015
C  -3.0879 -1.4558 0.417651
C  -4.136202 -0.555989 0.117989
C  2.490591 -1.765251 0.176946
C  3.644592 -0.972472 0.06221
H  -0.017174 1.731288 -0.479375
H  -2.235437 2.210809 -0.643672
H  -0.922415 -1.759166 0.544968
H  -4.613627 1.479661 -0.507818
H  -3.321289 -2.485736 0.711326
H  -5.181138 -0.877767 0.179103
H  2.54657 -2.853234 0.273945
H  4.64705 -1.407649 0.02663
H  3.126996 2.842879 -0.014047
H  1.503192 2.800657 0.595253
