program: Gaussian 09
title: 000279225
version: EM64L-G09RevD.01
frameworkgroup: C1[X(C10H10ClOP)]
method: RPBEPBE
basis: SDD
operation: Freq
keyword: #p
keyword: freq=noraman
keyword: PBEPBE/SDD
title: #p freq=noraman PBEPBE/SDD
converged: YES YES NO NO
title: Mulliken charges:
elementType: Cl P O C C C C C C C C C C H H H H H H H H H H
charge: -0.032202 0.979107 -0.634753 -0.730336 -0.391907 -0.481260 -0.146588 0.022590 -0.307181 -0.257357 -0.207347 -0.220988 -0.224619 0.303683 0.274105 0.264479 0.250646 0.296227 0.295959 0.242997 0.236670 0.233962 0.234115
chargesum: 0.00000
title: Mulliken charges with hydrogens summed into heavy atoms:
elementType: Cl P O C C C C C C C C C C
charge: -0.032202 0.979107 -0.634753 -0.152548 0.123218 -0.185034 -0.146588 0.022590 -0.011222 -0.014360 0.029322 0.012975 0.009496
polarizability: 1.93893705e+02 9.58790236e+00 1.31626175e+02 -9.82435534e+00 -7.69826581e+00 9.20586337e+01
1716.lowfreq: -10.6903 -5.5437 -0.0037 -0.0023 -0.0018 6.1768 29.2012 35.7881 65.8371
frequency: 28.9727 35.6093 65.8363 104.5211 143.7692 206.7189 212.2097 253.9425 274.1954 314.3492 362.0033 397.6866 401.4438 428.0260 486.4251 521.1840 610.4805 647.8195 679.6409 706.4616 724.8810 762.1226 778.0202 811.8631 824.1571 864.8942 939.0486 941.0110 953.7629 982.9731 990.1939 992.8456 1010.2437 1019.6410 1023.2969 1077.6188 1085.6168 1140.9881 1170.4750 1173.4704 1184.8039 1213.9464 1219.9715 1305.2610 1306.9641 1380.4791 1425.8288 1432.4434 1459.6155 1463.4727 1588.3147 1595.0067 1617.4941 3005.6804 3046.2021 3056.1785 3117.5829 3121.2408 3130.1023 3139.4257 3151.4641 3166.2083 3211.1589
redmass: 4.4989 4.1872 3.2069 2.7739 7.0240 4.9183 5.7841 6.6535 7.8104 5.1974 7.5940 3.0322 6.4229 2.5970 3.5373 8.0316 6.4653 6.4646 6.0499 1.9362 4.7844 1.6066 1.4591 3.8703 1.5328 1.2467 1.6456 1.8039 2.2358 5.6274 1.3787 5.3202 1.3292 2.8459 2.7722 1.6232 2.8016 1.1584 1.5603 1.0576 1.1272 1.1598 1.1704 1.5038 1.3710 9.0877 2.0878 1.0874 1.1109 2.0262 6.1536 5.8466 7.3874 1.0595 1.0592 1.1024 1.0879 1.1057 1.0867 1.0915 1.0960 1.1015 1.0969
irintensity: 0.2032 0.3560 0.4930 1.3511 7.5513 7.3779 3.6182 3.6252 6.1940 4.6663 7.0748 7.6212 48.7088 5.4426 22.7957 44.8582 0.0027 14.2265 9.6775 50.1660 11.0001 61.6171 32.2986 67.5982 62.7839 0.6204 15.2298 19.3794 8.7459 21.7833 0.5934 38.6403 0.2548 2.1656 9.0315 3.0364 45.0523 4.5530 33.7013 0.1182 3.4338 12.4911 17.1196 12.8856 17.1763 0.4952 21.6495 8.3329 26.3099 6.7067 0.0362 1.0416 146.6177 15.3970 6.2095 5.4379 4.4305 4.2292 2.0954 4.8143 20.1471 33.7009 5.3847
temp: 298.150 k
press: 1.00000 atm
elementType: 17 15 8 6 6 6 6 6 6 6 6 6 6 1 1 1 1 1 1 1 1 1 1
symmnumber: 1
zpe: 451514.1 jmol-1
zpe.correction: 0.171973 hartree
zpe.thermalcorrener: 0.184444 hartree
zpe.thermalcorrenthalpy: 0.185389 hartree
zpe.thermalcorrgfe: 0.131169 hartree
zpe.sumelectzpe: -1262.600156 hartree
zpe.sumelectthermal: -1262.587685 hartree
zpe.sumelectthermalent: -1262.586740 hartree
zpe.sumelectthermalfe: -1262.640960 hartree
dipole: 0.9848 -3.7043 2.7265
dipole: 4.7038
quadrupole: -82.8819 -100.0982 -88.5378
quadrupole: -4.8414 -4.7358 2.9619
quadrupole: 7.6241 -9.5923 1.9682 -4.8414 -4.7358 2.9619
hfenergy: -1262.772129 hartree
pointgroup: C01 [X(C10H10Cl1O1P1)]
dipole: -0.7391753 -0.4290079 -1.6414388 debye
dipolederiv: -0.6163392 0.4290915 0.198154 0.5350159 -0.4965531 -0.1132524 0.2321779 -0.0879027 -0.1626945 1.9173245 0.044414 -0.1178547 -0.1681355 1.175784 0.2413306 0.0746777 0.0118604 1.0669473 -0.8181757 -0.0348736 -0.007438 0.0377406 -0.6320073 -0.1111917 0.0281124 -0.0518759 -0.677204 -0.2433421 -0.023282 0.0976541 0.0272802 -0.1745206 0.0294772 -0.0062058 0.0902852 -0.2230647 -0.0243135 0.1264705 0.0790556 0.0267494 -0.0915117 0.1283287 0.173931 0.0510659 -0.037118 -0.7951795 0.1062008 0.2173186 0.1054074 -0.4474295 -0.1339062 0.2080106 -0.1437935 -0.438648 -0.2632401 0.0074443 -0.0017923 0.0127611 -0.2694654 -0.0361838 -0.0638242 -0.003728 -0.2419838 0.8633037 -0.6332837 -0.4409238 -0.559251 0.6110656 -0.0158308 -0.6096255 0.1198052 0.3736182 -0.1636396 0.0585062 0.0953122 -0.1052789 -0.0645736 0.0741547 -0.1528861 0.0574339 -0.0102043 -0.114921 -0.0793555 -0.1004896 0.0383531 -0.0731696 0.0434083 0.0747878 0.05537 -0.0440588 0.0362976 -0.0764805 -0.1333764 -0.0428878 -0.0877515 0.0693197 -0.0747331 0.0714163 -0.0257902 -0.1174769 0.0379421 0.0471654 0.0170497 -0.0437805 0.1230301 0.0265317 0.1178743 0.0115095 0.108742 0.0535816 0.0296062 0.032355 -0.0929097 0.0631826 -0.0032699 0.0597564 -0.0663389 0.0218142 -0.0481566 0.00622 -0.0252968 -0.0356804 -0.0317485 0.0343153 -0.0186616 0.0885533 0.0151375 0.0485785 -0.0639844 0.0725381 0.0760655 -0.0026015 -0.1154078 0.0304981 -0.015963 -0.0874951 -0.049827 0.0310194 -0.0541246 0.0568109 0.0252128 0.0180702 -0.0103457 0.0887017 0.0796339 0.0075382 -0.0350345 0.0075033 0.0595055 -0.0647191 0.0161599 -0.0462546 -0.0768857 0.1523262 0.0568632 0.0180062 0.0591858 0.0442666 0.0585813 0.0403628 0.0429495 0.1179655 0.1705683 -0.0300466 -0.0418174 0.0021942 0.1003956 -0.0620868 -0.0038158 -0.0559369 0.0733875 0.0067166 0.0508346 0.0908282 0.051309 0.1006756 -0.0464664 0.0919771 -0.0485321 0.0463176 -0.0556046 0.0381063 0.0872287 0.0409511 0.1090226 -0.0745019 0.096371 -0.074261 0.0439174 0.0428335 -0.0343451 -0.0267111 -0.051367 0.0563529 -0.1251952 -0.0512887 -0.1281132 -0.0014742 -0.114971 -0.0559214 -0.0281462 -0.0600523 0.119408 -0.0383417 -0.0344287 -0.0389097 0.11051 unknown
polarizability: 185.9860541|-10.5777781|111.8894792|-22.0821929|25.0253109|119.7029797 unknown
InChI: InChI=1S/C10H10ClOP/c11-9-6-7-13(12,8-9)10-4-2-1-3-5-10/h1-5,8H,6-7H2
charge 0 multiplicity 1
23 atoms
Cl 3.949336 -2.080011 -0.891427
P  0.781322 0.610512 0.656341
O  0.848258 1.50669 1.998985
C  1.554982 1.36558 -0.923509
C  2.667189 0.395297 -1.416401
C  1.856868 -0.908297 0.554626
C  -0.974465 0.084749 0.278415
C  2.701271 -0.812001 -0.495144
C  -1.990495 0.587397 1.123377
C  -1.289914 -0.774993 -0.799212
C  -3.33632 0.230211 0.881164
C  -2.637682 -1.127659 -1.038029
C  -3.659974 -0.624017 -0.198981
H  1.959385 2.347351 -0.629312
H  0.765723 1.516716 -1.676201
H  3.661109 0.879373 -1.416433
H  2.478786 0.059102 -2.453009
H  1.818036 -1.71869 1.283807
H  -1.708328 1.243291 1.955395
H  -0.496685 -1.180091 -1.440193
H  -4.128417 0.614894 1.532731
H  -2.889278 -1.794923 -1.869673
H  -4.704008 -0.900483 -0.384417
