program: Gaussian 09
title: 000279224
version: EM64L-G09RevD.01
frameworkgroup: C1[X(C11H13Br2OP)]
method: RPBEPBE
basis: SDD
operation: Freq
keyword: #p
keyword: freq=noraman
keyword: PBEPBE/SDD
title: #p freq=noraman PBEPBE/SDD
converged: YES YES NO NO
title: Mulliken charges:
elementType: Br Br P O C C C C C C C C C C C H H H H H H H H H H H H H
charge: -0.014469 0.028117 1.071560 -0.645737 -0.717649 -0.682771 -0.431247 -0.453475 -0.879725 0.477337 -0.350610 -0.423457 -0.226321 -0.221785 -0.238960 0.321985 0.294515 0.294214 0.323866 0.358154 0.351554 0.267413 0.291926 0.281643 0.234293 0.230872 0.228112 0.230645
chargesum: 0.00000
title: Mulliken charges with hydrogens summed into heavy atoms:
elementType: Br Br P O C C C C C C C C C C C
charge: -0.014469 0.028117 1.071560 -0.645737 -0.101149 -0.064690 -0.073093 -0.101921 -0.320386 0.477337 -0.068967 -0.189164 0.004551 0.006326 -0.008315
polarizability: 1.98469846e+02 -6.85049828e+00 1.89698437e+02 2.14640220e+01 -1.28747371e+01 1.31383169e+02
1716.lowfreq: -0.0014 -0.0011 0.0007 1.7446 6.7738 14.7144 23.8510 34.2151 36.0957
frequency: 23.8070 34.1297 36.0334 59.3053 81.6128 118.1205 136.4829 169.6800 181.6378 209.0664 249.1024 265.3730 292.4526 325.6093 340.6581 404.5924 450.7474 491.3220 502.6821 558.2552 568.9100 593.2508 614.8696 634.8165 667.6012 704.9771 764.2990 767.9799 803.5077 839.7759 856.0241 862.6262 870.4157 875.6342 929.8858 977.4417 979.6618 989.2428 994.6055 999.6302 1027.9538 1069.1249 1076.9388 1110.4931 1117.9045 1150.3086 1159.7620 1173.8268 1177.4090 1192.4636 1203.1212 1210.6358 1226.7720 1232.3923 1277.9305 1299.7711 1330.5024 1381.6204 1413.2929 1417.1822 1426.4016 1443.1042 1483.5015 1590.6886 1612.6110 3010.0459 3028.8701 3034.1306 3086.0273 3110.1767 3114.7006 3118.4816 3121.3990 3127.1984 3128.4359 3139.0584 3149.7900 3165.4582
redmass: 6.6444 5.7074 6.4982 7.3414 7.5657 7.7138 6.7797 8.1104 8.6913 5.6593 5.7345 3.9942 2.7710 2.1380 2.7170 2.8261 3.8761 5.1065 4.4373 5.1875 3.2573 6.6207 6.0881 4.2283 4.1176 1.8348 2.1944 2.9810 4.2414 1.6888 1.2732 1.9152 1.9559 3.1434 1.4598 1.9959 1.7574 4.4990 3.6930 1.3607 2.2331 1.5493 1.5794 1.0984 1.0624 1.1244 1.1607 1.0582 1.7924 1.1337 1.2408 1.7533 1.4365 1.7563 1.4580 1.4238 1.2687 8.0701 1.0787 1.0820 1.1558 2.0051 2.2890 6.0156 5.9996 1.0588 1.0636 1.0613 1.1036 1.0876 1.0878 1.0921 1.1002 1.0992 1.0865 1.0918 1.0963 1.1016
irintensity: 0.3006 0.1149 0.1182 1.0551 4.4996 2.3330 3.1871 5.0275 4.0146 6.7738 17.7927 4.5516 4.5480 1.2960 6.9655 0.1584 2.8018 37.1081 53.6635 10.2115 17.8871 30.5917 0.0556 1.3266 1.3185 52.5428 40.2920 17.4068 12.4473 6.0637 2.3085 55.8604 13.8649 10.8272 8.8768 31.8303 10.1144 0.1031 47.8657 1.6860 8.4233 12.5269 30.3987 3.1070 8.6779 10.1601 17.1075 0.7805 45.7214 0.2497 10.0086 0.8898 1.6403 8.6943 2.4903 5.0355 1.1294 0.0681 41.0356 3.4264 3.9610 13.4082 26.1576 1.8666 9.4729 8.4465 1.6828 0.6326 1.6598 0.1052 9.5912 3.1904 1.1843 0.1987 0.2641 16.5809 20.8974 24.8616
temp: 298.150 k
press: 1.00000 atm
elementType: 35 35 15 8 6 6 6 6 6 6 6 6 6 6 6 1 1 1 1 1 1 1 1 1 1 1 1 1
symmnumber: 1
zpe: 558448.6 jmol-1
zpe.correction: 0.212702 hartree
zpe.thermalcorrener: 0.228261 hartree
zpe.thermalcorrenthalpy: 0.229205 hartree
zpe.thermalcorrgfe: 0.166109 hartree
zpe.sumelectzpe: -869.219594 hartree
zpe.sumelectthermal: -869.204034 hartree
zpe.sumelectthermalent: -869.203090 hartree
zpe.sumelectthermalfe: -869.266186 hartree
dipole: -0.2682 3.3810 -1.3070
dipole: 3.6347
quadrupole: -110.1192 -127.1176 -113.3746
quadrupole: 1.1230 7.1970 5.4709
quadrupole: 6.7513 -10.2471 3.4958 1.1230 7.1970 5.4709
hfenergy: -869.4322955 hartree
pointgroup: C01 [X(C11H13Br2O1P1)]
dipole: 0.011165 -1.3558762 -0.4543311 debye
polarizability: 199.6628131|-9.3489533|192.3059788|-14.5209615|11.4763365|127.5826599 unknown
InChI: InChI=1S/C11H13Br2OP/c12-10-7-15(14,8-11(10)13)6-9-4-2-1-3-5-9/h1-5,10-11H,6-8H2
charge 0 multiplicity 1
28 atoms
Br -2.700874 -2.539579 -0.23201
Br -3.786036 1.990354 -1.117424
P  -0.884886 0.648109 0.893326
O  -0.51454 2.104925 1.484537
C  -2.594891 -0.050487 1.387531
C  -1.224537 0.512869 -0.980232
C  -3.243747 -0.567023 0.096417
C  -2.725611 0.225776 -1.121273
C  0.425828 -0.671122 1.317612
C  1.702722 -0.466912 0.526972
C  2.475571 0.713154 0.702377
C  2.137216 -1.442235 -0.407324
C  3.662599 0.903329 -0.037847
C  3.327976 -1.250982 -1.145605
C  4.094764 -0.077672 -0.961867
H  -3.173762 0.800419 1.789193
H  -2.510012 -0.824863 2.163875
H  -0.634617 -0.326091 -1.390847
H  -0.911625 1.442846 -1.476046
H  -4.340309 -0.629391 0.135949
H  -3.007649 -0.230473 -2.080291
H  -0.022802 -1.661343 1.130107
H  0.592752 -0.5533 2.404247
H  2.130095 1.480902 1.404225
H  1.550932 -2.359767 -0.545799
H  4.249817 1.817338 0.104828
H  3.656639 -2.016578 -1.857442
H  5.018788 0.070599 -1.531687
