program: Gaussian 09
title: 000279191
version: EM64L-G09RevD.01
frameworkgroup: C1[X(C14H9O6P)]
method: RPBEPBE
basis: SDD
operation: Freq
keyword: #p
keyword: freq=noraman
keyword: PBEPBE/SDD
title: #p freq=noraman PBEPBE/SDD
converged: YES YES NO YES
title: Mulliken charges:
elementType: P O O O O O O C C C C C C C C C C C C C C H H H H H H H H H
charge: 1.065415 -0.653330 -0.575904 -0.435816 -0.435788 -0.237719 -0.237718 -0.298840 -0.298784 0.398556 0.398509 -0.481446 -0.481460 -0.322041 -0.322019 0.276990 0.277006 -0.336311 -0.336328 0.097073 0.097071 0.283502 0.283506 0.263522 0.263516 0.286428 0.286402 0.393687 0.391161 0.391159
chargesum: 0.00000
title: Mulliken charges with hydrogens summed into heavy atoms:
elementType: P O O O O O O C C C C C C C C C C C C C C
charge: 1.065415 -0.259643 -0.575904 -0.044655 -0.044629 -0.237719 -0.237718 -0.298840 -0.298784 0.398556 0.398509 -0.197944 -0.197954 -0.058519 -0.058503 0.276990 0.277006 -0.049882 -0.049926 0.097073 0.097071
polarizability: 2.90723443e+02 7.99704100e-06 2.42466500e+02 2.78604946e-03 -5.66618489e+00 8.80074726e+01
1716.lowfreq: -2.7908 -0.0005 0.0007 0.0017 4.5969 4.8197 47.7616 48.3227 61.1197
frequency: 47.7602 48.3224 61.1190 63.4329 80.0953 85.6540 99.4301 148.6517 161.4668 182.8921 193.7814 220.1371 241.3584 250.3288 305.4057 324.6501 327.0249 344.4437 424.1103 428.0323 439.7596 458.7515 476.4349 506.3827 517.5494 518.2658 547.5222 549.6777 609.7262 621.1125 629.0483 630.1789 634.9589 682.0553 708.8455 719.3894 740.4212 769.8684 770.4015 775.4611 865.1077 866.4505 870.8200 952.1385 953.0177 978.9732 990.8611 991.3378 1010.0676 1027.0866 1031.0915 1042.6649 1081.4284 1082.5533 1136.3464 1144.5458 1144.6254 1150.9876 1234.6199 1263.0931 1266.2694 1323.5475 1326.8577 1370.9616 1394.7627 1397.4371 1432.3536 1468.0617 1475.0879 1573.9680 1578.7916 1612.2641 1618.6215 1643.2152 1646.6394 3152.7750 3153.2025 3154.0366 3158.0641 3187.0459 3187.1382 3532.8850 3532.9745 3578.6916
redmass: 11.0274 8.6458 9.5094 8.5355 9.5074 6.0058 4.8732 9.2516 7.4227 9.8807 4.0800 9.1123 1.4014 7.3704 7.1938 8.1973 2.6295 6.9229 4.8781 4.1824 11.3503 3.1459 7.6284 6.1496 3.1602 9.1887 2.1219 4.4412 1.3610 4.6583 4.4999 2.0020 5.3464 8.7017 6.0629 5.7206 4.2142 4.0103 4.3285 7.3060 1.4050 6.0586 1.4579 1.4697 1.6668 2.9756 1.3877 1.3877 5.1346 3.1064 4.2511 2.5454 2.0081 2.7397 1.6485 2.2648 1.6465 1.3135 2.1747 1.3785 1.5473 2.4622 2.2021 7.0376 3.6384 5.0690 4.4827 4.5168 3.0109 6.9983 8.3951 6.3775 7.2935 9.0223 9.0275 1.0915 1.0910 1.0921 1.0920 1.0954 1.0954 1.0642 1.0643 1.0658
irintensity: 0.0213 3.9736 0.7667 0.8145 0.5927 10.2750 0.3896 8.4476 0.0218 4.8303 3.1942 3.8634 55.6883 8.5794 31.8083 39.7849 18.3966 1.3389 7.7870 9.0843 5.3494 1.0172 0.4514 4.7779 74.2635 1.0576 2.4905 55.9771 218.3139 17.8787 48.3252 18.3613 91.7236 109.7991 24.7984 207.4034 0.0101 4.5190 0.0954 13.1451 0.0100 9.6196 37.2243 30.5123 0.0047 26.1637 0.0817 1.7462 340.8295 26.6184 295.0344 34.5721 0.0057 53.8029 28.9220 203.3540 34.7026 28.6917 1.0829 3.5242 13.8171 175.2998 38.1377 13.6857 107.3529 0.6440 0.7299 0.4216 11.7405 35.8439 13.2818 11.3825 0.5771 1.7323 435.6382 7.3460 2.0103 0.1244 0.7436 0.0607 0.5835 95.9440 28.0119 81.8095
temp: 298.150 k
press: 1.00000 atm
elementType: 15 8 8 8 8 8 8 6 6 6 6 6 6 6 6 6 6 6 6 6 6 1 1 1 1 1 1 1 1 1
symmnumber: 1
zpe: 531903.8 jmol-1
zpe.correction: 0.202591 hartree
zpe.thermalcorrener: 0.221061 hartree
zpe.thermalcorrenthalpy: 0.222006 hartree
zpe.thermalcorrgfe: 0.155099 hartree
zpe.sumelectzpe: -1330.026721 hartree
zpe.sumelectthermal: -1330.008251 hartree
zpe.sumelectthermalent: -1330.007307 hartree
zpe.sumelectthermalfe: -1330.074213 hartree
dipole: -0.0001 0.1626 1.1102
dipole: 1.1221
quadrupole: -90.0928 -139.0175 -135.2379
quadrupole: 0.0023 0.0028 9.0801
quadrupole: 31.3566 -17.5681 -13.7885 0.0023 0.0028 9.0801
hfenergy: -1330.2293128 hartree
pointgroup: C01 [X(C14H9O6P1)]
dipole: -0.0020724 0.0557818 0.4379215 debye
polarizability: 290.7179915|0.3571521|242.627104|0.7738207|-2.7663458|87.8523199 unknown
InChI: InChI=1S/C14H9O6P/c15-13(16)7-1-3-11-9(5-7)10-6-8(14(17)18)2-4-12(10)21(11,19)20/h1-6,15,17,19H
charge 0 multiplicity 1
30 atoms
P  -0.044051 2.746289 -0.022709
O  -0.05465 3.386235 1.605128
O  -0.048464 3.928946 -1.106544
O  5.206242 -1.682319 -0.006591
O  -5.230087 -1.75767 -0.045349
O  3.42937 -3.177957 0.025454
O  -3.431988 -3.227345 0.000419
C  1.295383 1.454944 -0.012011
C  -1.364865 1.435913 -0.021858
C  0.720112 0.151116 0.002409
C  -0.771139 0.140472 -0.003109
C  1.571708 -0.969728 0.009364
C  -1.606556 -0.992491 -0.002343
C  2.68293 1.654792 -0.030529
C  -2.754966 1.615714 -0.050783
C  2.977343 -0.777449 -0.002119
C  -3.014671 -0.820537 -0.02432
C  3.534538 0.526749 -0.024868
C  -3.590321 0.475542 -0.051391
C  3.840146 -1.993751 0.007267
C  -3.859774 -2.04923 -0.021148
H  1.184947 -1.993966 0.021911
H  -1.205081 -2.010996 0.013222
H  3.101494 2.665836 -0.053306
H  -3.187886 2.620615 -0.076788
H  4.621346 0.640154 -0.037359
H  -4.678517 0.573446 -0.072012
H  -0.061477 4.378783 1.593036
H  5.731279 -2.527062 0.000087
H  -5.742846 -2.609943 -0.042463
