program: Gaussian 09
title: 000279203
version: EM64L-G09RevD.01
frameworkgroup: C1[X(C12H7Cl2N2O6P)]
method: RPBEPBE
basis: SDD
operation: Freq
keyword: #p
keyword: freq=noraman
keyword: PBEPBE/SDD
title: #p freq=noraman PBEPBE/SDD
converged: YES YES NO NO
title: Mulliken charges:
elementType: Cl Cl P O O O O O O N N C C C C C C C C C C C C H H H H H H H
charge: -0.003972 0.002152 1.128817 -0.704046 -0.537531 -0.173128 -0.181160 -0.212912 -0.173950 0.026441 0.022016 -0.171822 -0.338490 0.390522 0.390242 -0.141759 -0.133938 -0.329798 -0.354644 -0.168301 -0.145558 -0.199171 -0.185528 0.284087 0.349323 0.294547 0.297626 0.421847 0.274124 0.273965
chargesum: 0.00000
title: Mulliken charges with hydrogens summed into heavy atoms:
elementType: Cl Cl P O O O O O O N N C C C C C C C C C C C C
charge: -0.003972 0.002152 1.128817 -0.282200 -0.537531 -0.173128 -0.181160 -0.212912 -0.173950 0.026441 0.022016 -0.171822 -0.338490 0.390522 0.390242 0.142328 0.215385 -0.035250 -0.057018 -0.168301 -0.145558 0.074952 0.088437
polarizability: 2.87856624e+02 1.75318664e+01 2.14614205e+02 -1.70744331e+01 8.22860609e+00 1.76007288e+02
1716.lowfreq: -5.6721 -4.4306 0.0010 0.0021 0.0025 7.4892 24.2716 29.5453 39.5234
frequency: 24.1806 29.4454 39.4885 70.8616 74.8170 82.6450 83.8117 122.8119 127.3396 151.0477 157.9604 180.5280 193.3954 220.8580 229.0851 245.2908 272.5973 283.8768 298.1969 300.0223 310.5077 329.7909 356.1301 380.1292 425.5772 436.5091 442.3531 480.7116 512.3376 520.8385 534.8019 548.8291 562.8307 565.4494 643.9000 651.5514 654.0681 657.6161 681.4812 723.8044 733.5928 734.8946 739.0254 803.4423 806.1475 843.3101 846.6987 877.8920 925.1829 977.6793 980.5862 1009.2487 1024.4832 1030.2487 1063.3357 1090.1788 1091.0525 1116.6987 1119.4586 1143.3376 1145.8899 1210.6111 1217.1552 1256.1073 1259.9316 1354.7628 1358.2059 1380.7879 1382.9407 1395.5619 1398.5139 1438.6390 1438.9821 1564.6453 1567.5431 1584.6243 1585.3612 3165.3221 3172.2784 3174.0220 3182.6290 3189.2291 3190.9070 3560.7248
redmass: 15.7520 12.1984 10.4581 14.4372 9.5822 7.7230 9.1660 12.8328 15.5941 8.4690 8.9122 13.9218 11.3493 7.1920 8.7639 9.2703 7.6222 8.6474 10.0373 17.5608 7.9733 6.5255 7.2614 6.0526 3.8226 2.5696 3.6069 1.8955 8.5289 8.7556 7.8063 7.4730 5.7509 5.4637 7.8228 5.7902 6.1900 6.4306 13.3714 9.4046 5.3355 7.0303 7.1212 9.0151 8.7877 1.4390 1.4303 1.4104 1.3548 1.3531 1.3489 6.7434 3.7875 6.4988 1.4800 3.0091 2.7963 2.9459 2.6567 1.4596 1.4022 9.2221 9.4780 1.3412 1.3357 3.9682 4.0475 6.7053 6.6500 10.5008 10.3565 2.4294 2.4482 6.8930 7.2201 7.6836 8.0621 1.0919 1.0894 1.0892 1.0930 1.0977 1.0978 1.0646
irintensity: 0.4071 0.3265 0.3233 0.7263 0.1556 2.4809 3.0359 0.4005 1.1494 3.4608 1.0193 5.2627 11.6180 12.9488 11.7054 2.2968 2.3261 5.0509 0.5160 1.1514 12.5595 4.0911 1.2301 8.1359 34.7976 41.3865 9.5624 243.0113 20.9593 14.7685 23.3563 1.9039 18.7322 9.3937 4.1257 13.5428 20.2729 26.5993 114.5331 4.4029 4.7260 2.2235 13.0234 60.6038 39.9311 37.8450 36.8614 3.6375 9.5830 1.7227 2.1243 30.1830 13.8371 23.0076 150.6460 65.9599 75.8298 33.5115 107.1610 29.3505 19.2056 247.9874 248.5943 6.4981 19.3159 61.1660 45.2903 108.8770 40.7620 65.9815 83.8075 46.0318 25.0233 93.3314 64.0953 36.2881 23.9794 0.6789 1.9119 1.7550 17.4917 1.3260 1.6291 98.6302
temp: 298.150 k
press: 1.00000 atm
elementType: 17 17 15 8 8 8 8 8 8 7 7 6 6 6 6 6 6 6 6 6 6 6 6 1 1 1 1 1 1 1
symmnumber: 1
zpe: 470965.9 jmol-1
zpe.correction: 0.179381 hartree
zpe.thermalcorrener: 0.200693 hartree
zpe.thermalcorrenthalpy: 0.201637 hartree
zpe.thermalcorrgfe: 0.127414 hartree
zpe.sumelectzpe: -2281.842882 hartree
zpe.sumelectthermal: -2281.821571 hartree
zpe.sumelectthermalent: -2281.820627 hartree
zpe.sumelectthermalfe: -2281.894850 hartree
dipole: 1.8783 5.0064 -4.5264
dipole: 7.0057
quadrupole: -132.9381 -163.2170 -167.2480
quadrupole: -8.0252 10.1234 5.1990
quadrupole: 21.5296 -8.7493 -12.7802 -8.0252 10.1234 5.1990
hfenergy: -2282.0222638 hartree
pointgroup: C01 [X(C12H7Cl2N2O6P1)]
dipole: -0.7264349 2.620202 0.4514947 debye
polarizability: 285.8602583|-25.2705801|193.726194|-16.1552321|-17.7408587|198.8916644 unknown
InChI: InChI=1S/C12H7Cl2N2O6P/c13-7-1-3-9(15(17)18)11(5-7)23(21,22)12-6-8(14)2-4-10(12)16(19)20/h1-6,21H
charge 0 multiplicity 1
30 atoms
Cl 1.199315 3.944966 -1.46351
Cl -4.579209 1.012043 2.863181
P  0.088495 -1.118296 0.648695
O  0.039845 -0.999541 2.387583
O  0.275263 -2.595415 0.075904
O  4.573654 -1.518337 0.628367
O  -2.298009 -1.024086 -3.162714
O  2.611254 -1.866023 1.726546
O  -0.305906 -0.764088 -2.07918
N  3.356676 -1.206939 0.897064
N  -1.599575 -0.752079 -2.117645
C  1.37224 0.192465 0.178482
C  -1.626279 -0.368032 0.378603
C  2.775349 -0.00494 0.253658
C  -2.30481 -0.375725 -0.869084
C  0.910663 1.412107 -0.360324
C  -2.345325 0.050837 1.520748
C  3.694086 0.955002 -0.227616
C  -3.65917 0.003059 -0.987844
C  1.830275 2.382787 -0.802884
C  -3.689598 0.45597 1.389727
C  3.222088 2.166654 -0.761313
C  -4.363512 0.430798 0.152354
H  -0.161146 1.6110 -0.444139
H  -1.853583 0.028444 2.496012
H  4.764207 0.741178 -0.164637
H  -4.135865 -0.036944 -1.970752
H  0.83441 -1.448625 2.779676
H  3.91671 2.926115 -1.128967
H  -5.410242 0.737645 0.080708
