program: Gaussian 09
title: 000025530
version: EM64L-G09RevD.01
frameworkgroup: C1[X(C20H17N3O5)]
method: RPBEPBE
basis: SDD
operation: Freq
keyword: #p
keyword: freq=noraman
keyword: PBEPBE/SDD
title: #p freq=noraman PBEPBE/SDD
converged: NO YES NO NO
title: Mulliken charges:
elementType: O O O O O N N N C C C C C C C C C C C C C C C C C C C C H H H H H H H H H H H H H H H H H
charge: -0.236468 -0.236433 -0.280251 -0.280247 -0.268150 -0.213965 -0.644533 -0.644521 0.046862 0.046850 0.217730 0.217726 0.045872 0.045855 0.089604 0.089617 -0.347265 -0.190957 -0.190955 -0.382601 0.291354 0.291335 -0.269191 -0.383672 -0.383669 -0.227790 -0.227798 -0.498113 0.233111 0.233219 0.239310 0.239286 0.386956 0.360657 0.386955 0.360662 0.189342 0.189405 0.293668 0.293671 0.239725 0.239727 0.235338 0.201372 0.201368
chargesum: 0.00000
title: Mulliken charges with hydrogens summed into heavy atoms:
elementType: O O O O O N N N C C C C C C C C C C C C C C C C C C C C
charge: -0.236468 -0.236433 -0.280251 -0.280247 -0.268150 -0.213965 0.103080 0.103096 0.046862 0.046850 0.217730 0.217726 0.045872 0.045855 0.089604 0.089617 0.119066 -0.190957 -0.190955 0.095995 0.291354 0.291335 0.109556 -0.090005 -0.089998 0.011934 0.011930 0.139966
polarizability: 5.39929338e+02 -3.09894095e-02 2.85721919e+02 4.32932843e+01 1.55847348e-02 1.25075009e+02
1716.lowfreq: -8.3946 -5.6734 -3.8047 0.0005 0.0009 0.0010 16.2091 18.0645 43.5191
frequency: 15.3148 18.0598 43.5182 48.8177 68.7176 81.2566 95.0794 117.1800 119.9889 137.3543 139.3379 150.9727 153.4436 161.6669 205.4637 216.2625 231.6173 242.2798 255.1873 273.5046 298.1038 318.0948 332.7471 346.8483 355.5193 391.9026 410.4132 420.6959 425.0698 436.4545 449.2355 456.3779 482.5737 503.3155 510.5578 531.6998 600.5302 616.3274 632.7702 641.6112 654.1839 682.6857 684.6173 689.5400 722.9779 727.3912 733.9637 746.7172 764.9757 786.5101 790.1024 809.7867 814.1605 819.0380 861.6380 869.2117 870.2251 878.2158 900.5413 936.1814 963.0222 989.3456 998.7585 1002.5422 1015.2124 1031.7679 1045.5718 1047.9159 1060.7884 1087.3001 1091.8072 1112.5340 1137.3794 1153.6264 1160.3711 1171.0189 1177.2462 1183.5078 1220.8018 1236.0021 1277.9838 1283.6198 1286.1365 1302.3180 1332.7430 1344.7608 1362.6105 1370.8208 1381.5443 1390.9358 1395.6685 1410.4760 1417.3000 1439.1832 1440.6521 1449.9842 1457.8664 1459.8982 1465.5783 1467.9684 1477.2244 1488.2991 1493.1503 1525.7501 1557.3459 1564.4172 1592.1861 1592.1872 1605.5288 1609.9749 1636.3495 1672.2925 2903.4372 2925.6466 2949.5783 2997.3350 3008.0124 3018.8641 3063.5801 3089.8059 3105.1176 3137.0082 3153.5687 3166.4773 3174.2087 3328.3565 3329.9413 3548.8458 3549.4649
redmass: 5.4567 5.8274 6.8699 1.9257 8.1848 2.6086 7.0664 2.1648 5.7322 6.0686 5.3512 6.6354 7.6232 5.0367 7.7162 4.5508 1.1923 7.8825 3.1424 8.6582 7.2716 3.9930 5.5904 7.4105 3.7845 8.0080 6.1161 8.2739 3.3705 6.4010 9.2770 7.2862 4.5864 6.4659 6.0962 7.7578 7.3621 8.8230 6.3176 6.5054 4.9549 3.8573 1.2683 1.4234 5.7557 4.1588 2.4125 1.6499 4.8480 8.1556 2.0010 1.6584 1.1064 1.2851 2.3117 2.8766 7.0196 2.4890 5.9072 1.9767 8.6327 3.9783 1.3880 2.9778 1.3613 2.0431 3.8785 3.8244 3.9595 4.0676 2.1095 1.2560 2.2208 1.5764 1.5070 1.1516 1.9539 3.3956 1.5571 1.8460 1.1277 2.2478 1.3001 5.1043 1.2246 5.4539 4.9352 2.1738 2.4421 1.9579 3.6812 5.2913 3.0363 2.2385 1.3832 2.8909 1.3165 1.0508 3.1228 1.0636 1.0767 4.4373 1.0823 9.1323 1.7087 1.8377 4.9013 4.5598 7.3372 6.4927 6.7125 11.4331 1.0530 1.0353 1.1059 1.1027 1.0594 1.0585 1.1037 1.1061 1.0971 1.0864 1.0907 1.0944 1.0997 1.0535 1.0530 1.0997 1.0996
irintensity: 0.0027 0.7262 0.2930 6.1673 0.0150 0.5095 3.5466 3.5104 0.0094 4.6584 0.2626 1.5210 0.0018 2.9579 0.0269 0.4167 4.2436 3.3351 5.4816 5.6926 4.4013 0.0281 0.0009 2.1352 6.4849 0.0028 3.8461 54.9840 1.0512 0.0018 15.4797 2.6844 6.4070 0.1000 0.0000 11.9995 66.6433 17.3595 42.6404 0.8019 0.0164 39.4715 0.0234 175.4670 2.5184 0.3348 8.1483 3.2322 80.9799 0.0825 5.9346 126.0424 0.0070 162.0943 2.5562 0.0044 4.6975 1.7113 74.7343 0.0001 28.6231 194.3776 5.1331 20.2944 0.0003 0.1213 20.0499 14.5505 85.7540 103.1425 6.5348 0.7713 38.1159 8.4267 2.4534 71.2711 15.2597 164.4190 0.6434 14.9538 1.7656 1.6381 2.5040 628.6830 7.2665 580.1349 3.6607 80.4091 7.7815 12.4000 1.7505 64.5919 150.7971 2.1401 1.0654 7.2648 27.6012 12.0020 82.0951 15.7405 4.3730 122.8429 8.2013 130.0424 43.1884 431.4982 56.4456 137.4314 298.1776 111.9721 109.7136 122.6807 55.6618 124.5329 59.5257 70.6413 10.2571 38.6048 0.8980 18.2308 31.0729 4.2706 13.3082 1.1817 34.2904 1.3854 122.3461 21.3993 170.7829
temp: 298.150 k
press: 1.00000 atm
elementType: 8 8 8 8 8 7 7 7 6 6 6 6 6 6 6 6 6 6 6 6 6 6 6 6 6 6 6 6 1 1 1 1 1 1 1 1 1 1 1 1 1 1 1 1 1
symmnumber: 1
zpe: 894609.7 jmol-1
zpe.correction: 0.340739 hartree
zpe.thermalcorrener: 0.364875 hartree
zpe.thermalcorrenthalpy: 0.365819 hartree
zpe.thermalcorrgfe: 0.285421 hartree
zpe.sumelectzpe: -1310.814491 hartree
zpe.sumelectthermal: -1310.790356 hartree
zpe.sumelectthermalent: -1310.789412 hartree
zpe.sumelectthermalfe: -1310.869809 hartree
dipole: -0.3700 -0.0065 -0.9992
dipole: 1.0655
quadrupole: -117.6596 -169.0189 -166.1607
quadrupole: 0.0363 10.1818 0.0450
quadrupole: 33.2869 -18.0725 -15.2143 0.0363 10.1818 0.0450
hfenergy: -1311.1552303 hartree
pointgroup: C01 [X(C20H17N3O5)]
dipole: -0.1477562 0.0021189 0.3922952 debye
polarizability: 540.3974489|-0.0706766|285.7215611|-40.9862969|0.2626456|124.6072564 unknown
InChI: InChI=1S/C20H17N3O5/c1-28-8-4-7-23-19(26)13-14(20(23)27)16(22)12-11(15(13)21)17(24)9-5-2-3-6-10(9)18(12)25/h2-3,5-6H,4,7-8,21-22H2,1H3
charge 0 multiplicity 1
45 atoms
O  -2.662728 2.363551 0.714625
O  -2.664818 -2.360022 0.705833
O  2.861417 2.762753 -0.077784
O  2.859853 -2.761264 -0.081151
O  -7.391893 0.007773 -1.518913
N  -3.037243 0.00185 0.754886
N  0.278078 2.836686 0.292588
N  0.275409 -2.834212 0.28117
C  -0.845474 0.69997 0.443399
C  -0.846075 -0.697062 0.440903
C  1.57246 0.722982 0.103869
C  1.57183 -0.720985 0.10135
C  0.338897 1.472379 0.279292
C  0.337607 -1.469919 0.273979
C  -2.238198 1.173534 0.64223
C  -2.239231 -1.170141 0.63782
C  -4.495409 0.002106 0.939358
C  2.834286 1.470504 -0.07158
C  2.832975 -1.469006 -0.076806
C  -5.256016 0.005958 -0.406225
C  4.097158 0.712061 -0.252777
C  4.096599 -0.711045 -0.254746
C  -6.773084 0.008075 -0.19209
C  5.316334 1.415918 -0.424943
C  5.315262 -1.415395 -0.428499
C  6.521749 0.710108 -0.596767
C  6.521218 -0.710077 -0.598521
C  -8.851493 0.012297 -1.449748
H  -4.75102 0.899769 1.531592
H  -4.75178 -0.898457 1.526819
H  -4.97674 0.899177 -0.993543
H  -4.980072 -0.886133 -0.996837
H  1.167584 3.343048 0.168739
H  -0.632091 3.286579 0.422684
H  1.163923 -3.340957 0.152084
H  -0.635178 -3.283755 0.409562
H  -7.093319 -0.892891 0.381139
H  -7.09104 0.910726 0.379706
H  5.286126 2.509515 -0.419213
H  5.284169 -2.508978 -0.425814
H  7.461964 1.255844 -0.729418
H  7.46101 -1.256188 -0.732604
H  -9.210196 0.012117 -2.490845
H  -9.232487 0.91722 -0.929096
H  -9.23802 -0.889013 -0.926905
