program: Gaussian 09
title: 000279166
version: EM64L-G09RevD.01
frameworkgroup: C1[X(C7H8ClO3P)]
method: RPBEPBE
basis: SDD
operation: Freq
keyword: #p
keyword: freq=noraman
keyword: PBEPBE/SDD
title: #p freq=noraman PBEPBE/SDD
converged: YES YES NO NO
title: Mulliken charges:
elementType: Cl P O O O C C C C C C C H H H H H H H H
charge: -0.047018 1.238368 -0.663341 -0.663393 -0.612310 -0.189587 0.528411 -0.190994 -0.309058 -0.253855 -0.376889 -0.790526 0.291765 0.282264 0.246117 0.250848 0.250848 0.225856 0.391242 0.391251
chargesum: 0.00000
title: Mulliken charges with hydrogens summed into heavy atoms:
elementType: Cl P O O O C C C C C C C
charge: -0.047018 1.238368 -0.272099 -0.272142 -0.612310 -0.189587 0.528411 0.100771 -0.026794 -0.253855 -0.130772 -0.062973
polarizability: 1.62441085e+02 4.84495713e+00 1.21160122e+02 -3.63573920e-03 -1.47669779e-03 6.59544258e+01
1716.lowfreq: -102.7702 -3.5439 -0.0029 -0.0023 -0.0011 3.8960 7.4565 14.9835 80.5389
frequency: -102.7478 14.8679 80.5289 97.8586 115.9524 151.8637 201.3351 211.7012 238.7210 246.1267 299.8125 319.5151 326.7146 365.4244 402.1788 413.1680 436.6111 446.1941 575.2602 619.4057 678.1567 690.6287 704.7394 728.6821 821.8090 844.7802 879.3559 973.6316 980.0640 990.6909 997.5383 1033.2153 1047.8783 1063.5775 1124.6589 1159.7046 1224.7065 1273.3702 1358.3294 1387.7181 1403.0400 1459.8040 1467.3745 1473.2941 1564.7922 1604.8827 2987.6111 3067.0784 3099.9035 3139.4652 3160.0212 3178.0225 3591.5704 3595.2225
redmass: 1.3853 9.7300 4.0925 8.4181 1.0550 3.9876 11.3477 3.5707 7.4337 4.3353 1.6693 4.0000 2.2756 5.7114 6.9402 7.1831 3.0955 3.7657 4.8022 7.3242 8.8389 6.6935 3.6454 6.9403 5.5161 1.2901 1.4654 1.3255 1.1609 1.7110 1.6175 4.1095 1.5484 2.6874 2.8184 1.3629 2.6223 1.3534 3.7975 4.3316 1.2544 1.0442 1.2389 2.2129 6.1036 7.0396 1.0371 1.0969 1.1000 1.0885 1.0973 1.0939 1.0659 1.0663
irintensity: 46.6365 0.0011 2.4932 1.3505 0.1289 0.2947 3.0705 9.4435 32.7073 16.8680 71.3301 81.6014 103.5646 4.3873 9.9354 65.3142 6.5812 0.6615 0.9308 6.1737 59.4448 132.1611 22.4126 291.5796 33.4222 22.4470 8.0944 4.6651 37.7105 5.7847 6.0934 7.5174 11.1838 115.8128 122.5898 31.4264 3.5331 2.2436 18.3318 21.0206 16.6334 15.4433 11.6465 29.0552 10.6893 5.9028 13.9857 10.8631 15.7835 6.4347 5.3332 1.8960 59.8111 52.3843
temp: 298.150 k
press: 1.00000 atm
elementType: 17 15 8 8 8 6 6 6 6 6 6 6 1 1 1 1 1 1 1 1
symmnumber: 1
zpe: 360785.1 jmol-1
zpe.correction: 0.137416 hartree
zpe.thermalcorrener: 0.150143 hartree
zpe.thermalcorrenthalpy: 0.151087 hartree
zpe.thermalcorrgfe: 0.096870 hartree
zpe.sumelectzpe: -1297.611026 hartree
zpe.sumelectthermal: -1297.598298 hartree
zpe.sumelectthermalent: -1297.597354 hartree
zpe.sumelectthermalfe: -1297.651571 hartree
dipole: -0.6665 0.3629 0.0013
dipole: 0.7589
quadrupole: -75.3520 -83.1628 -85.2322
quadrupole: -16.7812 0.0113 0.0107
quadrupole: 5.8970 -1.9137 -3.9832 -16.7812 0.0113 0.0107
hfenergy: -1297.7484414 hartree
pointgroup: C01 [X(C7H8Cl1O3P1)]
dipole: -0.2743288 -0.1178221 -0.0005713 debye
dipolederiv: -0.4079638 0.3007317 0.0000753 0.3751599 -0.5376545 -0.0001368 0.0001046 -0.0001487 -0.0626962 2.3451771 0.1498084 -0.0001276 0.4187692 1.4776268 0.0001553 -0.000302 0.0001129 1.895462 -0.6620872 -0.1712028 0.0974034 -0.2743328 -0.7644236 0.2240379 0.2391993 0.1825123 -0.9712988 -0.6618377 -0.1712123 -0.0970409 -0.2745547 -0.765146 -0.2243604 -0.2387112 -0.1827764 -0.9708612 -0.8698663 0.0749759 -0.0000652 -0.0506387 -0.6624199 0.0000985 0.0000664 0.0000822 -0.6374848 -0.4028191 -0.017982 -0.0000062 0.0616281 -0.1117748 0.0000563 -0.0003226 0.0000414 -0.2461803 0.3672262 0.1660075 0.0000909 0.1385748 -0.1748094 -0.000064 0.000083 -0.0000686 0.0344212 -0.1616603 0.2178204 0.0000562 -0.0476685 -0.1377895 -0.0000343 0.0000266 0.0000247 -0.0104232 -0.0526967 -0.0937158 -0.0000208 0.1676255 -0.0040444 0.0000516 0.000135 -0.0000128 -0.101564 0.3369394 -0.5935621 -0.0001688 -0.6623828 0.7345594 0.0002324 -0.0001852 0.0002528 -0.0899725 -0.1536146 0.0206433 -0.0000011 0.0991226 0.0868513 0.0000786 0.0000515 0.0000777 -0.1559049 -0.2419607 0.0074352 -0.0000216 0.0879606 0.1154448 0.0000343 0.000009 0.0000304 0.038314 0.1099952 -0.0317229 -0.0000098 -0.0340845 0.0482776 -0.0000427 -0.0000143 -0.0000582 0.1487663 0.0816234 0.0736441 0.000009 0.052357 0.0551309 -0.0000306 0.0000003 -0.0000085 0.1563223 0.0199921 -0.0696252 -0.0000357 -0.0642585 -0.0616706 -0.0000712 -0.0000462 -0.0000713 0.1580106 0.015818 -0.0022017 0.0444812 0.0131654 0.0727264 -0.0910871 0.0850532 -0.055759 -0.0186596 0.0158453 -0.0021809 -0.0444739 0.0132053 0.0726247 0.0911532 -0.0850365 0.0558207 -0.0185814 0.074183 0.0079534 -0.000002 -0.1038964 -0.1317631 -0.0000943 -0.0000398 -0.0000823 0.1131266 0.1238532 0.0672286 -0.0017098 0.0421582 0.3441035 0.0279587 0.009437 0.0128319 0.3695461 0.1238534 0.0671575 0.0015672 0.0420904 0.3441507 -0.0279354 -0.0095082 -0.0128013 0.369658 unknown
polarizability: 161.190985|-8.5741594|122.4102156|0.00465|0.0182246|65.9544321 unknown
InChI: InChI=1S/C7H8ClO3P/c1-5-2-3-6(4-7(5)8)12(9,10)11/h2-4,9-10H,1H3
charge 0 multiplicity 1
20 atoms
Cl -2.704153 2.213137 0.000805
P  2.443611 0.024238 0.000456
O  2.685578 1.067454 -1.365459
O  2.684909 1.06947 1.36493
O  3.342485 -1.292538 0.00152
C  0.622572 -0.163085 0.000273
C  -2.198981 -0.545936 -0.000106
C  -0.226608 0.964815 0.000578
C  0.094462 -1.472065 -0.000186
C  -1.614382 0.747093 0.000377
C  -1.304865 -1.648353 -0.000361
C  -3.697359 -0.751842 -0.000314
H  0.179364 1.979503 0.001028
H  0.768973 -2.334832 -0.00035
H  -1.721718 -2.661238 -0.000708
H  -4.16391 -0.28326 0.88546
H  -4.163746 -0.282646 -0.885849
H  -3.948804 -1.825069 -0.000708
H  3.604565 1.049007 -1.736429
H  3.60381 1.051947 1.736145
