program: Gaussian 09
title: 000279169
version: EM64L-G09RevD.01
frameworkgroup: C1[X(C7H6NO7P)]
method: RPBEPBE
basis: SDD
operation: Freq
keyword: #p
keyword: freq=noraman
keyword: PBEPBE/SDD
title: #p freq=noraman PBEPBE/SDD
converged: YES YES NO NO
title: Mulliken charges:
elementType: P O O O O O O O N C C C C C C C H H H H H H
charge: 1.269333 -0.715121 -0.658498 -0.560252 -0.432996 -0.164244 -0.217422 -0.224321 0.026401 -0.384472 0.437561 -0.170383 -0.467286 0.297696 -0.326721 0.125453 0.325070 0.327814 0.292693 0.411535 0.410665 0.397497
chargesum: 0.00000
title: Mulliken charges with hydrogens summed into heavy atoms:
elementType: P O O O O O O O N C C C C C C C
charge: 1.269333 -0.303586 -0.247834 -0.560252 -0.035499 -0.164244 -0.217422 -0.224321 0.026401 -0.384472 0.437561 0.154687 -0.139472 0.297696 -0.034028 0.125453
polarizability: 1.99367570e+02 -6.84851601e-01 1.47575182e+02 8.88764045e-01 1.79509220e+00 6.76680765e+01
1716.lowfreq: -6.0495 -3.6523 -0.0019 -0.0011 -0.0006 6.9722 38.6209 50.7405 60.0841
frequency: 38.6048 50.7372 60.0836 99.6079 130.5516 152.2747 154.9008 190.3361 194.6909 201.7442 238.8036 285.0419 312.5194 317.1649 347.5679 371.2321 389.4500 422.8096 431.6917 468.5379 494.7392 511.1787 563.9993 607.1242 626.6386 659.0412 667.4870 688.5204 724.6240 742.4265 743.8861 754.1763 860.8430 889.0695 975.6446 1014.8434 1018.4398 1024.4765 1041.2484 1048.7181 1070.4802 1113.6370 1145.4507 1165.1080 1213.5006 1259.8408 1327.2438 1367.1214 1380.9220 1413.3139 1472.9850 1562.0091 1612.2017 1650.5784 3176.7628 3179.5093 3195.4723 3533.3021 3576.7620 3627.2076
redmass: 10.2411 11.7639 9.0330 5.5230 8.7066 6.0017 7.9593 3.2614 2.3877 5.3622 8.4135 6.3760 4.2839 8.7758 8.9830 5.2300 2.9928 1.6080 4.0017 7.5977 7.3990 3.5588 5.0036 1.5156 4.7668 7.9036 4.4530 10.1754 10.7872 6.3361 9.3616 4.2797 8.2292 1.3895 1.4941 1.4107 1.4563 4.6519 3.4476 2.4766 1.5226 1.8932 2.2516 1.6181 9.0733 1.3952 2.4045 4.1197 12.3785 5.6572 2.9170 8.6078 6.9033 9.3754 1.0924 1.0900 1.0967 1.0644 1.0653 1.0662
irintensity: 0.9007 1.6476 0.1524 6.1008 0.7831 1.9701 6.8790 27.4041 38.0135 28.8740 0.4954 30.7097 20.1678 15.5124 21.7846 42.2997 18.6288 231.1641 7.7030 40.3638 4.2925 51.2729 32.5333 71.3483 22.5636 17.0152 71.7087 187.5966 172.6918 36.4080 28.4851 14.6114 10.1425 21.2845 19.0564 11.6158 59.8383 41.2451 311.0637 16.0565 204.5442 98.4703 31.2868 40.7968 181.7143 1.3471 80.2670 11.4594 110.4462 32.5787 17.6383 14.6291 27.9394 239.5743 12.8136 3.9911 2.9685 69.2355 70.8926 102.9183
temp: 298.150 k
press: 1.00000 atm
elementType: 15 8 8 8 8 8 8 8 7 6 6 6 6 6 6 6 1 1 1 1 1 1
symmnumber: 1
zpe: 356241.2 jmol-1
zpe.correction: 0.135685 hartree
zpe.thermalcorrener: 0.151181 hartree
zpe.thermalcorrenthalpy: 0.152125 hartree
zpe.thermalcorrgfe: 0.092324 hartree
zpe.sumelectzpe: -1191.636759 hartree
zpe.sumelectthermal: -1191.621264 hartree
zpe.sumelectthermalent: -1191.620319 hartree
zpe.sumelectthermalfe: -1191.680120 hartree
dipole: -3.3755 -4.3325 -1.9123
dipole: 5.8156
quadrupole: -92.0693 -100.3895 -104.6899
quadrupole: 4.9441 -7.0347 -2.8404
quadrupole: 6.9803 -1.3400 -5.6403 4.9441 -7.0347 -2.8404
hfenergy: -1191.7724445 hartree
pointgroup: C01 [X(C7H6N1O7P1)]
dipole: -1.4391323 1.6421228 0.6837386 debye
dipolederiv: 1.9410629 0.1435399 0.1052749 0.5958122 1.8945412 -0.0129547 0.2313642 -0.0378021 1.5875159 -0.5332978 -0.1619902 -0.0031104 -0.3208802 -1.1411015 -0.0686036 -0.0378328 -0.0946598 -0.6836127 -0.9462181 -0.0255172 -0.1543416 -0.0427094 -0.4947932 0.1661721 -0.2799653 0.161762 -0.8802315 -0.7346795 -0.0220418 0.0252841 -0.1761984 -0.6299827 0.0021926 -0.0265593 -0.0428603 -0.6204416 -0.8790566 0.4970758 -0.0166151 0.6059194 -0.8517475 0.0166948 -0.0243 0.0170508 -0.4198874 -0.4724903 -0.1107943 -0.0321667 -0.1313751 -0.8721652 -0.0148289 -0.055979 -0.037684 -0.1825703 -0.8026105 -0.0025537 -0.1014116 0.0469921 -0.5006365 -0.0023923 -0.1357293 -0.0084521 -0.2066777 -0.9346643 -0.2427093 0.0113412 -0.1632655 -0.7820515 0.021393 0.003339 0.0175545 -0.3135694 1.1673143 -0.166093 0.1566821 -0.1904052 1.4632667 0.0127393 0.1684921 0.0561551 0.1728013 -0.1736506 0.0663172 -0.0363559 -0.264989 0.0155928 -0.0122346 0.0839275 0.0156551 -0.2618568 -0.2342383 0.1765293 -0.0242803 0.2918688 -0.3662674 0.0142718 -0.0255425 0.0131868 0.0859297 -0.4990197 0.2327535 0.0086196 0.1190014 0.0074527 -0.0103069 -0.0387215 0.0049849 -0.0459426 0.0189957 -0.1557766 0.0063742 -0.0981571 -0.0188903 0.0026193 0.010114 -0.0152326 -0.0454825 -0.5110408 0.0329981 0.0054886 -0.1241143 -0.1727674 0.0131069 0.0084809 0.0028071 0.0227619 0.2405269 -0.1530039 -0.0026013 0.1697882 0.0742794 -0.0066905 -0.0221564 -0.0083921 -0.0615536 2.0159393 -0.1231728 -0.0013175 -0.2106126 1.3009975 -0.0428609 0.0177866 -0.0376605 0.237615 0.1491938 -0.004741 0.0021442 -0.0051447 0.075418 0.0037062 0.0188507 0.0010017 0.1453467 0.161659 -0.0097715 0.002849 -0.0127341 0.1144655 0.0034574 -0.0102775 0.0067683 0.1703573 0.0946445 0.042979 -0.000651 0.0502849 0.0626431 0.002164 0.0033041 0.0063742 0.1542326 0.169246 0.0393371 0.0063445 0.0418879 0.3928469 -0.0058652 0.0129283 -0.0146947 0.4052321 0.5138909 0.0466426 0.0396468 -0.0065605 0.1492682 -0.0862752 0.0915447 -0.0098898 0.3306554 0.2484932 -0.1000071 0.0028022 -0.174409 0.2796313 0.0044955 0.0069315 0.0040276 0.4093782 unknown
polarizability: 199.0763089|3.9625053|147.8959914|-0.2803118|-1.1536505|67.6385281 unknown
InChI: InChI=1S/C7H6NO7P/c9-7(10)4-1-2-6(16(13,14)15)5(3-4)8(11)12/h1-3,9,13-14H
charge 0 multiplicity 1
22 atoms
P  2.659818 0.885018 -0.155212
O  2.600935 2.596714 0.045335
O  3.435756 0.528891 1.348265
O  3.384881 0.38492 -1.478005
O  -4.203272 1.266371 -0.046741
O  0.467764 -3.064297 0.009272
O  2.311725 -1.761875 0.291359
O  -4.066438 -1.054453 0.039273
N  1.037772 -1.920349 0.111049
C  0.812026 0.593631 -0.013211
C  0.208438 -0.691686 0.028848
C  -0.042383 1.720736 -0.050038
C  -1.187684 -0.863945 0.029564
C  -2.02048 0.275138 -0.007283
C  -1.443926 1.567909 -0.041683
C  -3.498666 0.059873 -0.001094
H  0.408485 2.714833 -0.081954
H  -1.619874 -1.868234 0.063506
H  -2.096602 2.444295 -0.065438
H  3.487997 3.030494 0.09319
H  3.69008 -0.427958 1.420208
H  -5.180553 1.080973 -0.043307
