program: Gaussian 09
title: 000279188
version: EM64L-G09RevD.01
frameworkgroup: C1[X(C14H13N2O6P)]
method: RPBEPBE
basis: SDD
operation: Freq
keyword: #p
keyword: freq=noraman
keyword: PBEPBE/SDD
title: #p freq=noraman PBEPBE/SDD
converged: YES YES NO NO
title: Mulliken charges:
elementType: P O O O O O O N N C C C C C C C C C C C C C C H H H H H H H H H H H H H
charge: 1.061362 -0.662235 -0.596954 -0.195701 -0.194663 -0.195100 -0.194769 0.022180 0.022601 -0.264948 -0.384417 0.475868 0.467760 -0.199105 -0.194712 -0.537106 -0.542379 0.418577 0.406571 -0.403014 -0.378616 -0.810473 -0.826312 0.266737 0.302557 0.297846 0.299291 0.296493 0.296593 0.255926 0.285804 0.233988 0.236740 0.242895 0.296778 0.393937
chargesum: 0.00000
title: Mulliken charges with hydrogens summed into heavy atoms:
elementType: P O O O O O O N N C C C C C C C C C C C C C C
charge: 1.061362 -0.268298 -0.596954 -0.195701 -0.194663 -0.195100 -0.194769 0.022180 0.022601 -0.264948 -0.384417 0.475868 0.467760 0.067631 0.107845 -0.239259 -0.243087 0.418577 0.406571 -0.106522 -0.082023 -0.034756 -0.049898
polarizability: 2.99585092e+02 2.15595398e+01 2.08405565e+02 4.81313267e+00 3.51420741e-01 1.62377249e+02
1716.lowfreq: -8.2706 -4.3136 -0.0019 -0.0013 -0.0011 2.8379 19.1236 26.6415 30.8672
frequency: 18.6708 26.6034 30.5920 54.6552 57.0047 68.3377 88.1597 97.1688 133.7706 140.2874 156.1271 161.3888 185.4109 192.4723 208.0756 209.1117 213.1057 229.9968 252.1582 272.1819 299.3676 346.3703 349.3098 379.0825 387.6522 398.0340 452.3436 456.5391 467.4691 505.7266 520.4276 527.3327 533.3212 535.4833 551.4611 576.7680 657.1104 681.1664 687.0975 693.1327 694.2630 744.0601 746.4698 748.8629 750.1135 855.5962 869.5239 897.1221 899.7014 928.9969 932.0277 968.1366 988.6298 998.5960 1006.2248 1006.9303 1022.9882 1048.6324 1053.6797 1058.5195 1062.0716 1099.1710 1101.7673 1135.9301 1140.3129 1205.9164 1209.1191 1218.4069 1218.6769 1266.8252 1269.7923 1370.9536 1371.2186 1372.9600 1375.9542 1406.9348 1407.5242 1413.8719 1414.9860 1456.8123 1459.0733 1462.7462 1470.0313 1478.7659 1483.2507 1581.1750 1582.8945 1605.1373 1607.0125 2980.8536 2984.2678 3062.4542 3065.9334 3102.3261 3104.8244 3147.7776 3159.9445 3172.5309 3173.5578 3189.4884 3189.5679 3574.7794
redmass: 5.1800 10.0936 5.8849 9.0946 8.1005 6.5523 1.1803 5.5243 5.5578 1.2249 4.9353 7.5945 3.7189 3.5114 4.9062 6.3350 6.4810 2.7184 3.7893 2.2050 3.0069 5.2956 4.3109 6.7920 5.4680 6.9679 3.0677 3.6292 5.1901 6.2581 5.0398 5.5861 4.7772 4.6520 5.8938 7.0440 9.9155 7.3124 7.5654 5.4307 5.5100 4.7910 8.6947 6.3609 4.0278 1.3864 1.3537 5.6641 5.7380 1.4020 1.3879 3.1383 1.3683 1.3474 1.5690 1.5964 2.0147 4.3123 2.0035 2.1540 1.5908 1.8990 1.9154 1.5891 1.6148 3.7120 3.2824 4.8923 5.2986 1.3438 1.3576 8.2434 8.9745 5.2395 5.2388 1.5919 1.9773 1.9002 2.5357 2.3412 2.0452 1.1031 1.1608 1.1464 1.1092 6.7780 6.7518 7.2107 7.0150 1.0403 1.0379 1.0936 1.0967 1.0999 1.1002 1.0901 1.0904 1.0923 1.0923 1.0953 1.0957 1.0658
irintensity: 0.7933 0.9478 0.1773 0.5766 0.8489 2.3792 1.3228 2.4868 1.6396 3.1163 1.9016 7.7332 1.5143 7.5878 4.5381 12.9972 6.1344 11.5441 17.7364 38.8007 23.2737 7.1946 30.5718 37.7421 8.2474 25.6315 5.5319 9.1698 8.8923 25.7111 2.3073 36.2074 4.3564 2.5128 1.9760 94.3803 67.6839 40.7823 65.9974 35.3070 71.1057 15.8680 48.0904 11.7211 3.3284 17.0745 27.0195 0.1991 0.7486 16.3483 15.0907 25.3812 4.1832 1.3007 3.3548 4.7411 45.5968 2.9701 14.5487 42.1703 18.0695 43.8262 49.4765 23.3260 16.3807 229.5354 63.9093 155.3069 87.0474 24.2458 15.3659 74.1128 69.3426 11.1540 4.8758 77.9860 75.1956 7.7499 25.0096 27.9161 30.2822 25.1289 21.6286 27.9997 30.8971 2.6565 1.5819 7.4953 18.0571 9.7370 11.3560 14.9106 6.8211 12.1328 10.9461 2.7963 2.9223 2.0156 2.2551 2.3172 1.9677 72.6501
temp: 298.150 k
press: 1.00000 atm
elementType: 15 8 8 8 8 8 8 7 7 6 6 6 6 6 6 6 6 6 6 6 6 6 6 1 1 1 1 1 1 1 1 1 1 1 1 1
symmnumber: 1
zpe: 664987.0 jmol-1
zpe.correction: 0.253280 hartree
zpe.thermalcorrener: 0.275769 hartree
zpe.thermalcorrenthalpy: 0.276713 hartree
zpe.thermalcorrgfe: 0.199320 hartree
zpe.sumelectzpe: -1441.540542 hartree
zpe.sumelectthermal: -1441.518053 hartree
zpe.sumelectthermalent: -1441.517109 hartree
zpe.sumelectthermalfe: -1441.594502 hartree
dipole: 0.1717 3.4727 -0.6817
dipole: 3.5432
quadrupole: -191.0314 -151.8905 -137.2680
quadrupole: 5.4324 -1.2549 -8.1108
quadrupole: -30.9681 8.1728 22.7953 5.4324 -1.2549 -8.1108
hfenergy: -1441.7938224 hartree
pointgroup: C01 [X(C14H13N2O6P1)]
dipole: -0.0444801 1.3536746 0.3298479 debye
polarizability: 298.8722085|-23.2276662|209.0776541|3.4594019|1.7346102|162.4180443 unknown
InChI: InChI=1S/C14H13N2O6P/c1-9-7-11(15(17)18)3-5-13(9)23(21,22)14-6-4-12(16(19)20)8-10(14)2/h3-8,21H,1-2H3
charge 0 multiplicity 1
36 atoms
P  -0.011463 1.900122 0.165016
O  -0.057718 2.422149 1.839681
O  -0.027284 3.137168 -0.860809
O  -4.604937 -3.153978 -0.140424
O  5.691347 -1.705849 1.258505
O  -6.015051 -1.362826 -0.068989
O  5.700981 -1.684489 -1.022117
N  -4.83651 -1.886646 -0.076412
N  5.181691 -1.381756 0.11899
C  -1.487802 0.763632 0.125083
C  1.535632 0.848364 0.105904
C  -2.80473 1.317487 0.140932
C  2.12711 0.495134 -1.145187
C  -1.278912 -0.633284 0.047348
C  2.124256 0.469917 1.336549
C  -3.894923 0.41947 0.069582
C  3.33567 -0.241005 -1.111832
C  -3.66498 -0.969064 -0.005972
C  3.90818 -0.607437 0.122826
C  -2.369484 -1.521171 -0.016837
C  3.324363 -0.266317 1.358932
C  -3.055476 2.808163 0.249205
C  1.511157 0.877972 -2.477418
H  -0.261048 -1.036659 0.045145
H  1.641407 0.76771 2.272196
H  -4.92445 0.78809 0.075934
H  3.838039 -0.534152 -2.037893
H  -2.23613 -2.604057 -0.072685
H  3.802046 -0.571437 2.292905
H  -2.801514 3.166151 1.264844
H  -2.424858 3.374343 -0.45912
H  -4.113805 3.047515 0.057516
H  2.168387 0.58881 -3.313086
H  0.536187 0.375097 -2.628719
H  1.315516 1.963327 -2.527581
H  0.246403 3.361606 1.940986
