program: Gaussian 09
title: 000279200
version: EM64L-G09RevD.01
frameworkgroup: C1[X(C22H24N3O5P)]
method: RPBEPBE
basis: SDD
operation: Freq
keyword: #p
keyword: freq=noraman
keyword: PBEPBE/SDD
title: #p freq=noraman PBEPBE/SDD
converged: YES YES NO NO
title: Mulliken charges:
elementType: P O O O O O N N N C C C C C C C C C C C C C C C C C C C C C C H H H H H H H H H H H H H H H H H H H H H H H H
charge: 1.222178 -0.611821 -0.266090 -0.267575 -0.206199 -0.204602 -0.870455 -0.844680 0.024885 -0.099465 0.487697 0.522428 -0.266411 -0.231100 -0.339351 -0.353904 0.387190 -0.345921 -0.370982 -0.401063 -0.409064 -0.344701 -0.347870 -0.350677 -0.350479 0.336582 0.340151 -0.244192 -0.243497 -0.684348 -0.685206 0.338170 0.323441 0.294136 0.271729 0.291326 0.291556 0.275082 0.300967 0.238029 0.219679 0.249349 0.246183 0.252152 0.249726 0.209032 0.208813 0.207499 0.208010 0.232509 0.208705 0.232045 0.207173 0.231415 0.231814
chargesum: 0.00000
title: Mulliken charges with hydrogens summed into heavy atoms:
elementType: P O O O O O N N N C C C C C C C C C C C C C C C C C C C C C C
charge: 1.222178 -0.611821 -0.266090 -0.267575 -0.206199 -0.204602 -0.532285 -0.521240 0.024885 -0.099465 0.487697 0.522428 0.027725 0.040628 -0.048025 -0.062348 0.387190 -0.070839 -0.070015 -0.163034 -0.189384 -0.095352 -0.101687 -0.098525 -0.100752 0.336582 0.340151 0.173653 0.172012 -0.011089 -0.014803
polarizability: 5.37808328e+02 -7.54477112e+01 3.17532766e+02 -1.31571182e+01 -8.59985064e+00 2.63361880e+02
1716.lowfreq: -5.4191 -3.2682 -0.7333 -0.0012 -0.0004 0.0016 9.2515 13.6154 21.4582
frequency: 9.2203 13.5329 21.4448 27.5540 32.4126 36.3581 48.5660 54.5278 70.1242 75.9930 87.5650 103.3365 115.7995 116.6134 118.0210 121.0836 146.4114 153.9083 168.4997 191.0050 223.2578 229.7590 240.4239 243.0321 245.1674 271.5938 281.1463 313.3458 331.5329 349.8961 356.7510 379.9985 382.5123 399.7619 406.3870 413.8522 417.7990 433.2884 448.7627 465.5396 501.2125 504.0918 508.5373 518.8682 522.6264 535.3843 570.1514 580.0989 620.3823 624.9468 627.1122 666.1191 687.9578 712.9637 716.6861 727.2472 734.2580 750.8998 772.3569 781.0477 795.6697 807.3538 809.8322 820.8663 828.0145 838.2197 841.1209 859.1135 868.5221 870.0402 875.2771 902.7166 903.0662 937.7333 942.3239 955.8899 960.9567 993.3565 999.9467 1000.4241 1004.0782 1006.4669 1018.5656 1037.5997 1038.3227 1080.7254 1088.6729 1107.4036 1113.0873 1113.7164 1119.7890 1120.5716 1135.6380 1136.4146 1176.5179 1181.5607 1182.3697 1212.0860 1214.9484 1219.8263 1248.5160 1251.5402 1261.5950 1262.8788 1288.6726 1292.1766 1307.7755 1322.1267 1335.4835 1360.4513 1366.6901 1367.1083 1392.2263 1397.5139 1398.5579 1400.9485 1402.6776 1406.1963 1433.1567 1446.1369 1460.6618 1460.6876 1461.0218 1476.5735 1477.2265 1486.6219 1487.6535 1501.0459 1504.7762 1583.4596 1585.2445 1590.3325 1591.0473 1626.0387 1628.2036 2951.7257 2953.6567 2996.5401 2997.6671 3009.0759 3011.8102 3093.9647 3095.0186 3105.3315 3106.6643 3117.9276 3131.8649 3133.8607 3150.7432 3152.5204 3153.9755 3165.6215 3166.4110 3168.5740 3172.2105 3184.4226 3186.6516 3515.3958 3516.6140
redmass: 5.5602 6.7765 4.9992 4.6805 4.5058 3.9852 3.9921 3.9967 5.7048 5.8185 5.0128 6.1144 1.8218 2.3376 3.1600 6.4963 4.6055 6.0207 4.8060 5.8722 9.2753 5.4806 3.7467 1.2148 1.4817 5.7087 6.1310 4.0957 3.9964 5.4705 3.3932 5.4008 3.4266 4.0828 2.9490 3.1197 3.1010 3.1310 3.1829 4.1361 4.2868 5.9135 4.5777 2.8593 2.5403 1.5145 5.6459 5.1604 6.9965 6.4844 6.7557 5.0147 8.4481 4.0642 3.8555 4.0286 4.2731 4.1571 4.9488 5.3846 4.6698 1.2435 1.2929 1.3601 1.2382 1.3186 1.5712 1.3202 4.8313 4.0585 1.5795 3.2633 3.2396 1.3724 1.3731 1.3479 1.3379 1.3499 2.7243 2.7232 2.5669 1.6220 8.8004 2.8391 2.8648 4.8637 2.7397 1.3284 1.6941 1.8434 1.5612 1.4810 1.4399 1.4412 1.3814 1.3115 1.3043 4.3238 2.1646 2.3359 2.8128 2.4605 1.1413 1.1397 1.3169 1.6323 1.4633 1.6358 2.3930 6.2762 1.3401 1.3212 2.6126 1.3455 5.7834 1.4860 3.9474 2.8931 2.9817 2.4534 1.0401 2.1859 1.0398 1.1032 1.0886 1.2026 1.1584 1.9004 2.2009 7.0519 6.5280 6.2203 7.8419 6.3216 6.4025 1.0553 1.0554 1.0361 1.0362 1.1074 1.1076 1.0989 1.0989 1.1013 1.1013 1.0897 1.0897 1.0902 1.0901 1.0911 1.0884 1.0942 1.0947 1.0955 1.0965 1.0945 1.0958 1.0754 1.0750
irintensity: 0.1763 0.0632 0.1187 0.3475 0.2671 2.6177 0.3703 1.0401 0.0764 1.4263 8.9538 6.6967 1.9955 2.7823 1.8262 0.1704 1.7796 1.2052 1.0154 1.1979 3.4776 4.3896 4.2022 0.9253 0.3815 0.4397 1.7841 4.1138 13.3291 9.3663 16.7895 13.3778 3.8368 29.2769 1.1432 0.8316 2.3525 24.2716 62.9600 3.6175 38.6157 38.7883 43.0253 84.2579 58.4940 54.8846 1.4741 1.0698 0.1182 14.4697 1.1305 33.4657 11.0354 15.5203 3.6426 11.3827 1.5604 5.3949 45.6423 47.4472 16.7580 0.1161 5.2776 62.8687 47.5133 9.9589 89.6078 9.4239 72.3920 200.2407 6.5231 76.0109 36.1929 0.9247 7.5209 2.7332 6.3981 0.5321 26.5851 5.5228 3.9442 2.3121 67.8006 86.8756 81.0910 17.1559 22.4563 5.4911 3.4836 2.5205 15.1378 19.4606 3.8668 4.1358 195.9793 241.3897 46.9772 510.4980 411.3673 229.7425 27.2771 5.5503 0.0190 0.0171 20.2475 97.2555 4.1300 33.5259 10.3627 49.2115 20.3656 1.0086 17.2361 16.5924 1.3036 73.1789 102.9681 52.1695 6.5813 13.9199 11.6341 2.8176 11.8535 106.5749 34.9444 214.6485 6.1436 370.1441 20.0532 12.3416 4.5136 98.4456 5.0709 47.9041 3.5160 43.9644 34.9871 35.9866 27.5107 35.9762 33.8467 29.8878 27.1179 34.2606 32.6900 14.4582 5.9939 15.7261 2.2062 1.5870 10.6073 10.0991 6.9734 6.0276 17.2060 0.5492 1.7201 16.8543 37.0398
temp: 298.150 k
press: 1.00000 atm
elementType: 15 8 8 8 8 8 7 7 7 6 6 6 6 6 6 6 6 6 6 6 6 6 6 6 6 6 6 6 6 6 6 1 1 1 1 1 1 1 1 1 1 1 1 1 1 1 1 1 1 1 1 1 1 1 1
symmnumber: 1
zpe: 1115091.9 jmol-1
zpe.correction: 0.424716 hartree
zpe.thermalcorrener: 0.455377 hartree
zpe.thermalcorrenthalpy: 0.456321 hartree
zpe.thermalcorrgfe: 0.357926 hartree
zpe.sumelectzpe: -1731.984020 hartree
zpe.sumelectthermal: -1731.953360 hartree
zpe.sumelectthermalent: -1731.952415 hartree
zpe.sumelectthermalfe: -1732.050810 hartree
dipole: 0.2841 -4.0447 0.7123
dipole: 4.1167
quadrupole: -163.5673 -226.5951 -173.9865
quadrupole: 10.4254 0.6077 -2.3853
quadrupole: 24.4823 -38.5454 14.0632 10.4254 0.6077 -2.3853
hfenergy: -1732.4087361 hartree
pointgroup: C01 [X(C22H24N3O5P1)]
dipole: -0.0145629 -1.6193086 -0.0300924 debye
polarizability: 526.3439454|85.1260895|328.4487105|-33.219565|-4.3613187|263.9103178 unknown
InChI: InChI=1S/C22H24N3O5P/c1-3-29-20-11-5-17(6-12-20)23-31(28,22-15-9-19(10-16-22)25(26)27)24-18-7-13-21(14-8-18)30-4-2/h5-16,23-24H,3-4H2,1-2H3
charge 0 multiplicity 1
55 atoms
P  -0.285666 -0.74722 0.137671
O  -0.606325 -0.945887 1.695284
O  6.511493 -1.605003 0.01928
O  -7.213033 -0.986708 0.18014
O  2.008214 5.34481 -1.993391
O  1.170534 5.924826 0.048752
N  0.883868 -1.751005 -0.685904
N  -1.648128 -1.137454 -0.905918
N  1.430502 5.059267 -0.873673
C  0.312107 0.99305 -0.18512
C  2.299449 -1.707572 -0.45413
C  -3.035594 -1.089653 -0.563472
C  0.034413 1.969597 0.801344
C  0.958137 1.345696 -1.394205
C  0.399128 3.312229 0.580109
C  1.331095 2.683202 -1.625502
C  1.040249 3.646135 -0.633167
C  2.839021 -1.198644 0.751227
C  -3.501944 -1.358637 0.748126
C  3.183266 -2.179697 -1.461625
C  -3.979991 -0.786926 -1.58383
C  4.236997 -1.129458 0.942434
C  -4.884097 -1.320335 1.033667
C  4.573998 -2.144351 -1.263197
C  -5.357265 -0.77517 -1.306143
C  5.110979 -1.607511 -0.064879
C  -5.819333 -1.035294 0.007907
C  7.124865 -1.058841 1.246627
C  -7.744463 -1.236283 1.53403
C  8.636989 -1.166834 1.071013
C  -9.262924 -1.110777 1.442566
H  0.50242 -2.621201 -1.069733
H  -1.446288 -1.10543 -1.909821
H  -0.450614 1.662658 1.734168
H  1.18941 0.576396 -2.138179
H  0.203301 4.093602 1.318802
H  1.840896 2.991919 -2.541502
H  2.167919 -0.881526 1.557763
H  -2.781646 -1.586856 1.538891
H  2.777847 -2.569795 -2.402468
H  -3.633862 -0.560944 -2.600533
H  4.621904 -0.725501 1.88298
H  -5.212794 -1.527026 2.056368
H  5.264607 -2.513104 -2.02772
H  -6.089955 -0.553234 -2.087901
H  6.808784 -0.003242 1.378151
H  6.778327 -1.644127 2.123434
H  -7.443512 -2.250962 1.868129
H  -7.320419 -0.492538 2.240262
H  8.968637 -0.591029 0.190304
H  9.151875 -0.76902 1.964321
H  8.939045 -2.218837 0.932165
H  -9.719559 -1.289301 2.433091
H  -9.671961 -1.84734 0.730139
H  -9.549802 -0.101618 1.101069
