program: Gaussian 09
title: 000025391
version: EM64L-G09RevD.01
frameworkgroup: C1[X(C20H26N2)]
method: RPBEPBE
basis: SDD
operation: Freq
keyword: #pfreq=noraman
keyword: PBEPBE/SDD
title: #p freq=noraman PBEPBE/SDD
converged: YES YES NO NO
title: Mulliken charges:
elementType: N N C C C C C C C C C C C C C C C C C C C C H H H H H H H H H H H H H H H H H H H H H H H H H H
charge: -0.178539 -0.073274 0.172373 -0.466085 0.179938 -0.517493 0.272924 0.441497 -0.390133 -0.644181 -0.425011 -0.359016 -0.412466 -0.368062 -0.405439 -0.241479 -0.233651 -0.255800 -0.256053 -0.247615 -0.616697 -0.628711 0.197770 0.184379 0.198212 0.230043 0.237738 0.222133 0.212535 0.222948 0.220846 0.245536 0.167728 0.203710 0.240474 0.248264 0.236574 0.224564 0.223644 0.223753 0.222095 0.227013 0.223477 0.182322 0.219767 0.241159 0.215521 0.180771
chargesum: 0.00000
title: Mulliken charges with hydrogens summed into heavy atoms:
elementType: N N C C C C C C C C C C C C C C C C C C C C
charge: -0.178539 -0.073274 0.172373 -0.083937 0.179938 -0.089238 0.272924 0.441497 0.069738 0.012148 -0.179475 0.012421 -0.171992 -0.119799 -0.168865 -0.016914 -0.010007 -0.032048 -0.033958 -0.020603 0.008870 0.008739
polarizability: 2.30661335e+02 -1.12097952e+01 2.48530871e+02 -3.60590167e+00 6.03533643e+00 1.85700127e+02
1716.lowfreq: -11.6810 -8.9455 -6.6468 -0.0004 -0.0003 0.0004 16.2726 19.5385 32.8854
frequency: 15.5418 18.4193 32.8792 45.7571 67.0315 70.2333 101.4896 105.3928 120.2319 155.2546 184.9997 198.6586 208.1243 218.9163 226.0145 240.3690 252.0830 259.5302 282.2561 308.1747 329.9701 338.0397 362.0957 402.9388 418.6198 430.2258 452.3506 465.4609 479.8085 512.5600 554.2652 588.5173 616.6237 630.3393 638.8102 688.8269 705.1758 727.8683 742.4442 760.8630 770.2058 805.1736 818.2601 830.5785 854.6031 869.3487 882.5151 904.4051 932.7869 945.4227 979.1562 984.8079 987.4244 989.5559 995.0460 1012.4449 1014.2491 1023.3143 1029.4712 1031.3842 1048.2983 1068.0003 1076.9097 1084.8434 1092.2116 1093.6099 1109.0435 1115.6240 1130.0288 1151.7130 1159.0656 1166.8204 1170.2637 1172.0584 1184.0894 1188.3157 1195.8206 1212.9578 1227.5987 1249.8085 1262.2875 1275.0073 1286.3638 1291.7811 1300.1659 1322.5000 1333.3126 1346.6990 1373.2606 1375.8483 1394.2171 1415.7093 1430.9119 1432.6179 1439.4157 1448.9507 1458.8395 1459.8570 1460.3343 1463.5203 1473.1720 1473.5793 1475.7939 1479.1721 1482.5208 1482.9852 1489.7902 1490.5191 1585.5549 1598.9458 1607.1399 1622.1199 2799.0788 2832.9736 2834.1312 2850.2888 2885.7226 2962.1717 2976.8195 2992.1408 3003.6529 3012.8202 3013.3650 3013.9794 3029.1425 3070.6909 3072.9934 3073.9686 3090.6974 3119.4567 3120.1653 3126.8198 3127.5673 3140.6233 3142.3324 3151.1512 3160.0198 3163.1143
redmass: 2.6245 3.5180 3.7611 4.2104 4.6041 3.7373 3.2498 2.2858 2.1428 3.2550 2.4273 1.9167 2.8896 1.2220 1.4365 1.8260 1.6090 2.8507 2.8414 3.6990 2.4888 3.9799 3.0624 2.8268 2.5371 2.6009 4.9255 3.2682 3.2101 3.4456 3.4300 4.9061 6.3297 4.7646 5.5861 4.9986 1.6622 2.6151 1.6516 1.5565 1.4524 1.8674 4.1160 3.5161 1.2484 1.5166 2.3164 1.7878 1.6772 1.4574 1.3877 1.8712 1.5372 5.4659 1.3448 2.4265 1.9753 2.1175 2.0648 1.6132 3.5358 2.9660 1.9494 1.9779 1.6029 1.5920 1.3228 1.8029 1.3951 1.4635 1.5703 2.5277 1.1002 1.0615 2.5352 1.9130 1.1403 1.7822 3.1913 2.1621 2.5843 1.6147 1.5660 1.1862 1.3521 1.4120 1.8536 1.4658 1.5649 4.5251 5.8455 1.1442 1.1897 2.1315 1.1702 2.3793 1.0921 1.0580 1.0705 1.0703 1.9493 1.1975 1.0847 1.6920 1.1981 1.0779 1.0855 1.0871 5.9384 7.0872 6.0055 7.1174 1.0704 1.0579 1.0720 1.0579 1.0536 1.0586 1.0855 1.0814 1.0667 1.0872 1.0869 1.0715 1.0715 1.1026 1.0987 1.1008 1.0993 1.0842 1.0853 1.0895 1.0877 1.0945 1.0922 1.0944 1.1003 1.1005
irintensity: 0.4232 0.0273 0.1699 0.2276 0.1156 0.0918 1.4173 0.1487 0.7300 0.2704 0.1702 0.8666 1.7656 0.7931 3.0010 0.2292 0.2976 0.2386 6.9085 1.9712 9.1975 12.2052 1.1247 0.1387 0.3857 5.6362 0.3472 3.9952 10.9498 2.5325 14.6233 2.9208 0.3743 6.5274 7.6807 0.6468 49.5345 15.8783 21.7358 56.5565 33.8417 7.4109 18.3848 0.5642 0.0528 1.9828 3.4788 1.4349 0.9498 0.5813 0.1208 17.7216 8.3957 1.1170 0.5874 5.1042 16.9635 7.3427 18.5468 12.5822 15.0988 10.2909 3.3761 2.0315 9.0500 7.1040 6.3456 0.9491 5.0863 8.4358 11.9187 3.0748 0.4125 0.2084 15.3772 2.4330 3.6486 16.8741 16.9488 4.6862 8.4528 2.5634 24.7098 6.2031 1.0526 2.4871 6.5608 2.0006 14.8179 4.9540 3.1928 2.5626 1.8295 11.6671 4.4156 6.0144 1.2618 17.2090 13.9207 18.4557 10.6573 10.5991 16.4336 10.3308 24.0169 5.9232 15.8895 3.2699 0.9755 0.7549 10.6609 0.8876 74.4138 71.7306 91.7553 228.0638 109.6511 34.1512 49.3906 12.3516 30.5247 15.8078 41.1246 69.3616 44.4806 26.0106 15.8472 53.8217 44.1804 2.1598 2.8295 3.9841 4.1659 28.3909 23.2202 40.6155 35.1170 20.9150
temp: 298.150 k
press: 1.00000 atm
elementType: 7 7 6 6 6 6 6 6 6 6 6 6 6 6 6 6 6 6 6 6 6 6 1 1 1 1 1 1 1 1 1 1 1 1 1 1 1 1 1 1 1 1 1 1 1 1 1 1
symmnumber: 1
zpe: 1077316.0 jmol-1
zpe.correction: 0.410328 hartree
zpe.thermalcorrener: 0.432035 hartree
zpe.thermalcorrenthalpy: 0.432979 hartree
zpe.thermalcorrgfe: 0.357683 hartree
zpe.sumelectzpe: -885.561044 hartree
zpe.sumelectthermal: -885.539337 hartree
zpe.sumelectthermalent: -885.538393 hartree
zpe.sumelectthermalfe: -885.613688 hartree
dipole: 0.6276 -0.0212 -0.4065
dipole: 0.7481
quadrupole: -130.4363 -121.5986 -130.7723
quadrupole: 1.1590 5.4618 1.6571
quadrupole: -2.8339 6.0038 -3.1699 1.1590 5.4618 1.6571
hfenergy: -885.9713719 hartree
pointgroup: C01 [X(C20H26N2)]
dipole: 0.2521734 -0.0236417 0.1498872 debye
polarizability: 233.6995799|13.0873326|245.4639092|2.7593979|6.5553124|185.7288447 unknown
InChI: InChI=1S/C20H26N2/c1-21(2)15-9-14-20(18-11-5-4-6-12-18)19-13-8-7-10-17(19)16-22(20)3/h4-8,10-13H,9,14-16H2,1-3H3
charge 0 multiplicity 1
48 atoms
N  0.300469 0.12836 -1.761616
N  -4.569891 1.375993 0.083587
C  0.420394 0.240157 -0.256344
C  -0.697712 1.17564 0.294204
C  0.207446 -1.221112 0.151953
C  0.560634 -1.257814 -2.215269
C  0.279607 -2.076888 -0.97111
C  1.842541 0.722022 0.166564
C  -2.131132 0.702181 -0.021668
C  0.849777 1.196019 -2.600342
C  0.000241 -1.747404 1.441352
C  -3.182032 1.704703 0.494648
C  0.131454 -3.470079 -0.826973
C  2.942259 -0.178359 0.107055
C  2.112788 2.068994 0.524623
C  -0.152811 -3.146524 1.593747
C  -0.089844 -4.002793 0.466649
C  4.255787 0.247631 0.39656
C  3.426519 2.49972 0.82009
C  4.506838 1.592236 0.756402
C  -5.499355 2.486625 0.373506
C  -5.059719 0.10103 0.645487
H  -0.560913 1.281183 1.390495
H  -0.562723 2.188051 -0.137705
H  1.616953 -1.413863 -2.557329
H  -0.096634 -1.520565 -3.068679
H  -2.242531 0.586064 -1.114791
H  -2.293148 -0.293516 0.430488
H  1.96422 1.189786 -2.668479
H  0.541279 2.181854 -2.210932
H  0.443138 1.101856 -3.624892
H  -0.03964 -1.087436 2.315624
H  -3.097474 1.787697 1.613899
H  -2.948743 2.707719 0.083801
H  0.185435 -4.134486 -1.697246
H  2.764796 -1.229128 -0.147328
H  1.297614 2.796842 0.586422
H  -0.319682 -3.571927 2.589803
H  -0.211462 -5.083972 0.598516
H  5.082512 -0.470617 0.348701
H  3.604141 3.544293 1.101578
H  5.525223 1.924389 0.987373
H  -5.148699 3.406613 -0.128155
H  -5.602929 2.708774 1.467922
H  -6.503644 2.24466 -0.019138
H  -4.43149 -0.737284 0.302364
H  -6.089998 -0.082835 0.291324
H  -5.072162 0.091308 1.767156
