program: Gaussian 09
title: 000279128
version: EM64L-G09RevD.01
frameworkgroup: C1[X(C15H10ClNO)]
method: RPBEPBE
basis: SDD
operation: Freq
keyword: #p
keyword: freq=noraman
keyword: PBEPBE/SDD
title: #p freq=noraman PBEPBE/SDD
converged: YES YES NO NO
title: Mulliken charges:
elementType: Cl O N C C C C C C C C C C C C C C C H H H H H H H H H H
charge: -0.051268 -0.223213 -0.070162 0.106005 0.254721 0.352647 0.294761 -0.468339 -0.351882 -0.344543 -0.358955 -0.347033 -0.226594 -0.223065 -0.238189 -0.229521 -0.107431 -0.233756 0.247473 0.226756 0.278417 0.226535 0.269832 0.256994 0.258944 0.232196 0.233923 0.234745
chargesum: 0.00000
title: Mulliken charges with hydrogens summed into heavy atoms:
elementType: Cl O N C C C C C C C C C C C C C C C
charge: -0.051268 -0.223213 -0.070162 0.106005 0.254721 0.352647 0.294761 -0.220866 -0.125125 -0.066126 -0.132420 -0.077201 0.030400 0.035879 -0.005993 0.004403 -0.107431 0.000990
polarizability: 3.61942624e+02 1.39491965e+00 1.69588629e+02 1.00117300e-01 -2.33028066e-01 6.82094586e+01
1716.lowfreq: -0.0021 -0.0011 0.0011 2.0145 3.3796 16.8754 24.9336 29.4600 56.9717
frequency: 24.8619 29.3960 56.9364 59.5176 93.5320 151.0934 177.2259 202.8643 269.8438 270.3684 356.0380 361.1989 389.6721 399.8286 406.0804 480.4939 483.3469 501.9648 510.0126 614.7518 624.3042 638.8842 675.5453 678.2801 695.8144 716.4547 721.1943 774.9695 826.3213 830.9132 849.2943 854.2356 857.3614 917.9639 926.8944 932.2463 954.7057 982.3382 983.5337 988.5767 998.1937 1000.8437 1003.6181 1032.2632 1068.6148 1075.6375 1088.2660 1113.5208 1176.3629 1189.1733 1193.7803 1221.2765 1242.5214 1295.5773 1322.1865 1333.8250 1380.5906 1386.9075 1413.2322 1422.9787 1441.8167 1476.0566 1508.4349 1572.2825 1582.1370 1593.8948 1606.7826 1619.9149 3130.3139 3138.1134 3147.2686 3150.3399 3156.4565 3162.6764 3172.7125 3173.6586 3176.8222 3243.7071
redmass: 4.0857 5.1661 7.1018 6.6269 5.9101 6.3293 5.9526 8.9932 6.8061 5.8111 10.1089 6.6042 5.5606 2.7969 2.8794 7.0984 3.6548 3.4182 5.9270 6.4654 7.1563 6.3497 6.5666 2.5247 2.0937 7.0150 3.0222 1.7157 1.3684 1.5136 1.5468 1.3004 13.3733 9.7318 8.0205 1.4275 1.3708 1.3618 1.3851 6.1897 4.5132 4.0515 1.3299 1.9211 3.2098 2.0080 1.8450 1.4281 1.0578 1.1468 1.1188 1.7426 4.4796 1.3511 1.7532 2.3399 8.0312 8.7866 3.3931 3.2359 2.3765 2.3099 3.9597 6.9239 6.7374 7.1269 6.1003 6.2019 1.0852 1.0884 1.0886 1.0935 1.0891 1.0966 1.0963 1.1005 1.0978 1.0985
irintensity: 0.4533 0.3293 0.2692 3.5457 0.0001 2.0008 0.0352 0.2246 2.2067 0.0802 3.9286 1.0040 0.9391 0.0238 0.0006 27.8081 13.5454 13.5403 3.9098 0.0058 0.2392 0.4719 15.3064 20.3393 30.2934 2.3525 0.5354 79.5158 7.1529 77.6756 19.2519 0.0098 25.9047 6.4958 19.5821 4.2662 0.1527 0.4843 0.1862 0.6146 12.0280 32.1152 0.2339 7.2949 11.2488 43.7143 6.2844 10.2021 0.0032 6.4291 3.3240 4.2819 1.6480 0.7934 5.1755 6.2977 3.3088 3.0279 14.1771 106.2356 44.0925 98.8859 6.9799 59.7260 4.1802 23.7776 33.7190 3.9791 3.2788 2.1373 9.9143 25.2138 1.0092 20.7042 5.4479 16.2393 0.8305 1.4735
temp: 298.150 k
press: 1.00000 atm
elementType: 17 8 7 6 6 6 6 6 6 6 6 6 6 6 6 6 6 6 1 1 1 1 1 1 1 1 1 1
symmnumber: 1
zpe: 540004.0 jmol-1
zpe.correction: 0.205677 hartree
zpe.thermalcorrener: 0.220084 hartree
zpe.thermalcorrenthalpy: 0.221029 hartree
zpe.thermalcorrgfe: 0.161638 hartree
zpe.sumelectzpe: -1166.370696 hartree
zpe.sumelectthermal: -1166.356288 hartree
zpe.sumelectthermalent: -1166.355344 hartree
zpe.sumelectthermalfe: -1166.414735 hartree
dipole: -2.9751 -2.9239 -0.0289
dipole: 4.1715
quadrupole: -101.8608 -102.5471 -117.2704
quadrupole: 5.5806 0.0811 -0.1646
quadrupole: 5.3653 4.6790 -10.0443 5.5806 0.0811 -0.1646
hfenergy: -1166.5763727 hartree
pointgroup: C01 [X(C15H10Cl1N1O1)]
dipole: -1.1958284 -1.1226885 0.0557265 debye
polarizability: 361.9093967|-2.8850913|169.2387978|0.1384546|-6.2255623|68.5925171 unknown
InChI: InChI=1S/C15H10ClNO/c16-13-8-6-11(7-9-13)14-10-15(18-17-14)12-4-2-1-3-5-12/h1-10H
charge 0 multiplicity 1
28 atoms
Cl 6.735725 -0.733889 0.001339
O  -1.157417 1.633601 -0.113699
N  0.297411 1.731127 -0.119074
C  0.732291 0.439118 -0.051285
C  -1.524807 0.276357 -0.041995
C  2.180257 0.151739 -0.038019
C  -2.955789 -0.031686 -0.027517
C  -0.367462 -0.489737 -0.001961
C  2.65734 -1.182804 0.046548
C  3.124324 1.213356 -0.110417
C  -3.3980 -1.381069 0.057037
C  -3.920358 1.011674 -0.098539
C  4.040608 -1.459759 0.059039
C  4.508062 0.951674 -0.098769
C  -4.774968 -1.679164 0.069704
C  -5.296558 0.70689 -0.085417
C  4.947483 -0.38545 -0.013942
C  -5.730414 -0.637218 -0.001461
H  -0.306358 -1.572862 0.052773
H  1.954038 -2.01993 0.104099
H  2.762518 2.243963 -0.176211
H  -2.666837 -2.195127 0.113198
H  -3.581467 2.050108 -0.163969
H  4.404559 -2.488889 0.124359
H  5.231616 1.769879 -0.154787
H  -5.104333 -2.721734 0.135314
H  -6.031283 1.517276 -0.140826
H  -6.800482 -0.871147 0.008578
