program: Gaussian 09
title: 000279131
version: EM64L-G09RevD.01
frameworkgroup: C1[X(C9H20NO3P)]
method: RPBEPBE
basis: SDD
operation: Freq
keyword: #p
keyword: freq=noraman
keyword: PBEPBE/SDD
title: #p freq=noraman PBEPBE/SDD
converged: YES YES NO NO
title: Mulliken charges:
elementType: P O O O N C C C C C C C C C H H H H H H H H H H H H H H H H H H H H
charge: 1.351290 -0.504068 -0.514208 -0.624719 -0.547787 0.351302 -0.146000 -0.721792 -0.725084 -0.706695 -0.206276 -0.257909 -0.663969 -0.655528 0.278307 0.250106 0.231150 0.218355 0.209184 0.227625 0.227747 0.216351 0.222173 0.230491 0.235429 0.213550 0.221037 0.236544 0.204413 0.230712 0.230943 0.213849 0.254950 0.218525
chargesum: 0.00000
title: Mulliken charges with hydrogens summed into heavy atoms:
elementType: P O O O N C C C C C C C C C
charge: 1.351290 -0.504068 -0.514208 -0.624719 -0.547787 0.351302 0.132307 -0.022180 -0.060527 -0.037681 0.242703 0.199671 0.002099 0.031796
polarizability: 1.57279363e+02 5.17849090e-01 1.44825068e+02 8.84291520e-01 9.34000902e-01 1.18335282e+02
1716.lowfreq: -0.0014 -0.0010 -0.0007 9.4490 10.4459 13.4012 28.1157 37.2074 45.6365
frequency: 26.9431 37.0291 45.3426 56.5934 65.5277 87.5926 99.5832 149.5042 156.2160 160.2467 166.9538 184.5783 214.6085 222.4260 230.1531 242.1468 258.0584 269.5408 287.7886 307.3218 349.9553 371.8294 405.2898 421.3486 447.0245 478.7417 516.4768 561.5214 645.2848 666.6549 691.6102 743.4570 803.8950 806.6390 860.0448 877.0522 905.5221 949.3103 973.7159 988.0387 1009.9465 1015.7695 1021.8023 1035.2660 1073.6083 1092.2643 1104.1161 1120.5274 1133.1865 1134.5559 1144.7155 1146.0135 1244.9920 1259.6451 1273.3545 1326.4543 1349.9562 1354.0288 1384.0333 1391.9372 1392.5298 1393.4302 1401.9040 1413.7863 1453.9588 1456.5751 1461.1759 1464.3355 1465.0807 1466.1872 1478.2190 1479.3494 1482.3009 1485.3094 1491.3139 1493.3395 2978.8620 2985.9162 2986.3994 2988.6961 2990.0867 2994.2278 3005.8674 3056.7896 3062.2796 3072.4560 3074.7817 3076.1799 3077.5549 3082.2869 3083.8157 3088.9332 3103.4911 3104.8931 3107.6441 3110.5371
redmass: 2.4383 2.7703 3.1817 2.9052 2.5546 3.1210 4.6794 2.3999 1.4520 1.2633 2.0185 2.6643 2.0695 1.7415 1.6072 1.3175 1.9644 1.9504 3.3685 2.8658 4.6061 2.4646 3.9729 3.6620 4.4455 3.9444 3.0869 6.1121 7.3124 4.5792 5.9867 3.0532 1.1229 1.0874 3.3156 3.9727 3.5858 1.4921 1.6860 1.4727 1.3504 2.8250 2.8686 8.9315 1.7330 2.1217 2.2101 1.8012 1.4379 1.7095 1.7058 1.9024 1.1618 2.5385 1.1148 1.8212 1.2575 1.2111 1.3167 1.2291 1.2451 1.2492 1.3355 1.6698 1.0498 1.0404 1.0523 1.0538 1.0559 1.0574 1.0525 1.0494 1.0517 1.1245 1.0802 1.0855 1.0358 1.0357 1.0368 1.0371 1.0450 1.0483 1.0615 1.1068 1.0883 1.0990 1.0988 1.1028 1.0986 1.0977 1.1002 1.0979 1.0989 1.1041 1.1021 1.0977
irintensity: 0.0513 0.8152 1.7853 1.2765 2.7167 1.6543 0.9940 1.5407 2.7489 2.8649 10.8934 0.5105 3.4257 4.1564 0.4959 1.3531 5.0420 5.1712 12.1219 6.7950 5.4904 2.8323 6.0337 11.4931 4.0240 30.6437 13.5993 12.5825 119.0432 4.4892 110.5344 41.7221 5.5720 1.4802 146.3453 116.0758 151.4242 10.0119 47.1964 2.1268 21.5217 164.1944 107.0626 86.6146 29.3924 9.4625 10.8582 43.5909 1.7846 7.8370 14.5241 5.0907 2.1810 10.3336 0.1268 16.1207 2.6638 10.0779 17.1678 40.2288 10.2444 34.1388 18.7733 17.4056 7.6300 11.0832 8.6843 8.3081 4.8127 13.4263 5.2310 7.2364 16.7497 31.4862 13.0407 8.2354 18.7822 18.3110 26.4719 28.3643 22.1027 34.5714 32.6959 13.5357 4.9639 3.9930 9.9790 1.5170 52.4758 39.9682 13.1279 29.2668 21.0105 35.4366 37.6649 26.9304
temp: 298.150 k
press: 1.00000 atm
elementType: 15 8 8 8 7 6 6 6 6 6 6 6 6 6 1 1 1 1 1 1 1 1 1 1 1 1 1 1 1 1 1 1 1 1
symmnumber: 1
zpe: 745621.8 jmol-1
zpe.correction: 0.283992 hartree
zpe.thermalcorrener: 0.303119 hartree
zpe.thermalcorrenthalpy: 0.304063 hartree
zpe.thermalcorrgfe: 0.235808 hartree
zpe.sumelectzpe: -975.401770 hartree
zpe.sumelectthermal: -975.382643 hartree
zpe.sumelectthermalent: -975.381699 hartree
zpe.sumelectthermalfe: -975.449954 hartree
dipole: 1.4060 0.2101 -3.1190
dipole: 3.4277
quadrupole: -81.3366 -85.8921 -102.5239
quadrupole: 1.9163 5.2225 1.1479
quadrupole: 8.5810 4.0254 -12.6064 1.9163 5.2225 1.1479
hfenergy: -975.6857621 hartree
pointgroup: C01 [X(C9H20N1O3P1)]
dipole: 0.6184581 -0.0073582 1.1983796 debye
polarizability: 155.1481749|-4.9079198|145.9042736|-3.343925|-4.2018503|119.3872642 unknown
InChI: InChI=1S/C9H20NO3P/c1-6-12-14(11,13-7-2)10-8(3)9(10,4)5/h8H,6-7H2,1-5H3
charge 0 multiplicity 1
34 atoms
P  -0.38062 0.279385 -0.536742
O  -1.780193 -0.658493 -0.151125
O  -0.422726 1.689405 0.484731
O  -0.327597 0.582561 -2.100708
N  0.92536 -0.59809 0.266867
C  2.389656 -0.145495 0.204771
C  1.928075 -1.37686 -0.577218
C  2.747233 1.107948 -0.591607
C  3.110419 -0.275981 1.539148
C  2.189666 -2.817186 -0.186879
C  -2.03207 -1.067371 1.263996
C  -1.09745 2.902942 -0.065667
C  -3.265899 -1.96502 1.227171
C  -2.62404 2.792025 0.003624
H  1.844364 -1.204117 -1.662246
H  2.209524 1.148248 -1.555883
H  2.494409 2.016708 -0.015922
H  3.833533 1.122053 -0.797557
H  4.201325 -0.368136 1.380098
H  2.92594 0.623402 2.153922
H  2.759779 -1.151394 2.108338
H  3.146181 -3.163367 -0.621174
H  2.236395 -2.941164 0.907364
H  1.385263 -3.470681 -0.570506
H  -1.138179 -1.59387 1.645653
H  -2.200441 -0.158902 1.873541
H  -0.717316 3.714654 0.576626
H  -0.755353 3.062914 -1.105911
H  -3.51507 -2.306416 2.249416
H  -4.133022 -1.419734 0.817236
H  -3.082489 -2.850367 0.595103
H  -3.083813 3.73603 -0.344878
H  -2.99139 1.972813 -0.638927
H  -2.958151 2.606055 1.039447
