program: Gaussian 09
title: 000279127
version: EM64L-G09RevD.01
frameworkgroup: C1[X(C15H10ClNO)]
method: RPBEPBE
basis: SDD
operation: Freq
keyword: #p
keyword: freq=noraman
keyword: PBEPBE/SDD
title: #p freq=noraman PBEPBE/SDD
converged: YES YES NO NO
title: Mulliken charges:
elementType: Cl O N C C C C C C C C C C C C C C C H H H H H H H H H H
charge: -0.044926 -0.226134 -0.068648 0.251466 0.110739 0.312658 0.330699 -0.467617 -0.349480 -0.336230 -0.360747 -0.353887 -0.217318 -0.217342 -0.247427 -0.231981 -0.111789 -0.234361 0.247749 0.233463 0.276032 0.219493 0.272032 0.259420 0.260708 0.229156 0.231724 0.232547
chargesum: 0.00000
title: Mulliken charges with hydrogens summed into heavy atoms:
elementType: Cl O N C C C C C C C C C C C C C C C
charge: -0.044926 -0.226134 -0.068648 0.251466 0.110739 0.312658 0.330699 -0.219868 -0.116017 -0.060198 -0.141254 -0.081855 0.042101 0.043366 -0.018272 -0.000257 -0.111789 -0.001814
polarizability: 3.65022343e+02 -2.08726750e+00 1.69310079e+02 2.24589894e-02 2.66878628e-01 6.82377834e+01
1716.lowfreq: -0.0021 -0.0005 0.0018 1.3156 2.2060 13.4437 22.6840 30.6987 56.0691
frequency: 21.7144 30.6531 56.0512 56.7269 96.8730 153.0474 172.4061 204.0077 267.5694 276.7560 354.4545 357.9240 391.9605 399.9763 405.4926 472.0077 490.2554 496.9157 516.2117 616.0504 623.5525 636.4852 673.9986 679.9112 697.5824 715.4076 717.1746 779.7886 825.8145 830.4965 847.0043 853.9075 855.3935 916.2926 928.3911 933.4484 956.6716 977.1135 984.2435 989.7217 992.4729 1004.5829 1010.0769 1025.7628 1068.5490 1076.3615 1090.4782 1112.2981 1175.5676 1189.9428 1193.1774 1221.4825 1242.6755 1299.1143 1305.9009 1354.9114 1371.0783 1388.6733 1403.9251 1421.0519 1449.5603 1471.0404 1512.1062 1569.0882 1582.1001 1592.4280 1612.8061 1619.1935 3127.6589 3135.6046 3146.9270 3147.7282 3159.2650 3160.3738 3170.3765 3173.5024 3179.6802 3243.9488
redmass: 4.2150 5.0264 6.9760 6.9916 5.7067 6.3154 6.2473 8.7462 6.9137 5.4753 6.8884 9.6261 5.6288 2.7953 2.8825 7.2098 3.2463 3.8353 5.8797 6.4554 7.1630 6.4669 6.7222 2.4066 2.0145 3.3170 6.9093 1.7511 1.3471 1.5318 1.5602 13.3889 1.2863 9.6681 8.0415 1.4430 1.3612 1.3629 1.3823 6.1087 4.9146 1.3311 3.0413 2.4662 2.3311 2.3431 1.8290 1.4275 1.0561 1.1327 1.1318 1.7385 4.6393 1.3100 1.7600 2.7652 4.7838 9.7019 3.6797 3.0002 2.5750 2.4274 3.5209 7.0957 7.2727 6.4796 6.5351 6.0503 1.0849 1.0881 1.0890 1.0931 1.0963 1.0889 1.1011 1.0965 1.0979 1.0983
irintensity: 0.4793 0.2497 2.2960 1.6448 0.0140 2.7470 0.1132 1.2026 0.9861 0.0074 0.2820 3.5160 2.0753 0.0282 0.0112 19.2270 25.2691 2.7245 3.9421 0.0578 0.2724 0.0105 26.1947 20.5213 34.2382 0.0624 4.3173 73.7860 17.0647 75.3364 12.6033 16.2709 0.1922 13.3331 7.0663 4.4489 0.1495 0.3373 0.1996 4.0594 25.5757 0.3671 18.1087 7.4655 14.3835 39.9106 13.5141 10.3822 0.0117 4.1425 5.2296 3.3021 1.5142 2.0276 2.5160 8.6988 4.6120 5.9940 9.3523 51.4312 51.4553 172.2179 12.0178 11.8563 11.3324 0.5034 60.7834 1.7983 3.9299 3.5715 6.7374 29.9145 19.6447 1.4850 20.0005 4.0116 0.8818 1.6553
temp: 298.150 k
press: 1.00000 atm
elementType: 17 8 7 6 6 6 6 6 6 6 6 6 6 6 6 6 6 6 1 1 1 1 1 1 1 1 1 1
symmnumber: 1
zpe: 539880.2 jmol-1
zpe.correction: 0.205630 hartree
zpe.thermalcorrener: 0.220046 hartree
zpe.thermalcorrenthalpy: 0.220991 hartree
zpe.thermalcorrgfe: 0.161483 hartree
zpe.sumelectzpe: -1166.370328 hartree
zpe.sumelectthermal: -1166.355911 hartree
zpe.sumelectthermalent: -1166.354967 hartree
zpe.sumelectthermalfe: -1166.414474 hartree
dipole: -1.3833 2.9187 -0.0388
dipole: 3.2302
quadrupole: -104.3117 -102.3369 -117.2698
quadrupole: -6.4033 0.0854 0.2116
quadrupole: 3.6611 5.6359 -9.2970 -6.4033 0.0854 0.2116
hfenergy: -1166.5759573 hartree
pointgroup: C01 [X(C15H10Cl1N1O1)]
dipole: -0.5683213 -1.1357294 -0.0465688 debye
polarizability: 365.0025579|-1.9131209|168.9308871|-2.5714037|6.1807912|68.6367602 unknown
InChI: InChI=1S/C15H10ClNO/c16-13-8-6-12(7-9-13)15-10-14(17-18-15)11-4-2-1-3-5-11/h1-10H
charge 0 multiplicity 1
28 atoms
Cl 6.751519 -0.66101 -0.059437
O  0.302947 1.661482 0.10279
N  -1.155944 1.689467 0.116344
C  0.732294 0.322853 0.033805
C  -1.530443 0.378257 0.055839
C  2.175783 0.087139 0.011529
C  -2.963541 0.018892 0.051999
C  -0.386644 -0.497482 0.003586
C  2.691006 -1.234975 -0.085321
C  3.086079 1.178056 0.086217
C  -3.370331 -1.33975 -0.021902
C  -3.958167 1.033305 0.123288
C  4.079871 -1.467827 -0.10698
C  4.477294 0.95641 0.064983
C  -4.740323 -1.678153 -0.0242
C  -5.325049 0.69234 0.120691
C  4.955816 -0.365634 -0.031489
C  -5.72316 -0.664403 0.047102
H  -0.398991 -1.582624 -0.045943
H  2.008684 -2.089327 -0.145561
H  2.697987 2.198023 0.161111
H  -2.621112 -2.137143 -0.078228
H  -3.643855 2.0803 0.180567
H  4.474576 -2.484921 -0.181571
H  5.1761 1.795611 0.122553
H  -5.040429 -2.730182 -0.081834
H  -6.081561 1.48267 0.176321
H  -6.786606 -0.92767 0.04534
