program: Gaussian 09
title: 000279322
version: EM64L-G09RevD.01
frameworkgroup: C1[X(C21H25ClFN5O2S)]
method: RPBEPBE
basis: SDD
operation: Freq
keyword: #p
keyword: freq=noraman
keyword: PBEPBE/SDD
title: #p freq=noraman PBEPBE/SDD
converged: YES YES NO NO
title: Mulliken charges:
elementType: Cl S F O O N N N N N C C C C C C C C C C C C C C C C C C C C C H H H H H H H H H H H H H H H H H H H H H H H H H
charge: -0.048621 1.090792 -0.348636 -0.478222 -0.481848 -0.323474 -0.091441 -0.169158 -0.630681 -0.612909 0.187829 -0.375333 -0.590454 0.338199 -0.369225 0.642300 -0.719562 -0.679818 -0.542338 -0.564445 0.218934 -0.352525 -0.382542 0.530655 -0.208732 -0.020749 -0.351547 -0.416615 -0.230626 -0.215232 -0.113993 0.222341 0.212578 0.239522 0.218755 0.210793 0.233308 0.243906 0.231742 0.204637 0.238230 0.201146 0.235400 0.274375 0.214469 0.219823 0.259877 0.258438 0.248486 0.253388 0.336102 0.338135 0.286942 0.285701 0.320069 0.321853
chargesum: 0.00000
title: Mulliken charges with hydrogens summed into heavy atoms:
elementType: Cl S F O O N N N N N C C C C C C C C C C C C C C C C C C C C C
charge: -0.048621 1.090792 -0.348636 -0.478222 -0.481848 -0.323474 -0.091441 -0.169158 0.043555 0.029013 0.187829 0.059586 -0.132177 0.338199 0.074876 0.642300 -0.039277 -0.005042 -0.267963 -0.130154 0.218934 -0.092648 -0.382542 0.530655 0.049706 -0.020749 -0.103061 -0.163227 0.056317 0.070469 -0.113993
polarizability: 3.25254556e+02 -5.58373072e+01 3.73269570e+02 1.96659781e+01 1.38979042e+00 2.42079824e+02
1716.lowfreq: -7.5241 -2.7308 0.0008 0.0015 0.0019 3.4716 6.8013 12.8669 13.4356
frequency: 2.7076 12.7444 12.8634 18.2322 30.9571 33.1826 38.0484 50.2828 56.4805 78.6247 96.3846 112.2079 124.4150 126.8170 137.1855 148.9432 170.5873 187.0858 195.9247 206.8391 223.6807 224.2266 230.4219 242.6167 268.6738 270.6069 288.3351 303.1854 305.8704 312.4887 321.3540 336.3654 348.4166 362.4134 376.0742 383.3748 386.4556 390.0669 402.6599 419.5954 428.4481 439.2667 469.5872 472.4453 497.5417 507.5129 514.9765 518.7459 525.6056 530.2886 555.5208 559.8074 569.1146 617.3724 618.6160 629.1071 642.1099 667.3971 689.4813 717.0724 723.6927 726.9583 748.8115 791.4638 801.1462 817.5744 826.2876 835.0037 840.0718 853.9892 856.3945 864.0365 886.8425 910.3499 922.6276 947.1373 955.8577 962.0557 964.5368 980.9558 988.6484 990.4842 993.2075 1001.6165 1017.9524 1036.4900 1047.1009 1049.2991 1053.1299 1068.9901 1105.0862 1106.8898 1120.6432 1129.0879 1131.7475 1141.0089 1181.4758 1187.7777 1190.8690 1195.6945 1214.4251 1240.6287 1251.6705 1259.9783 1276.8400 1286.9996 1292.0791 1304.0528 1316.8244 1328.3293 1351.3839 1359.5020 1366.9972 1384.1785 1389.5939 1393.5195 1401.7173 1405.2316 1444.8197 1448.9138 1460.2574 1460.7968 1463.1231 1465.5305 1468.3883 1473.0682 1476.1761 1476.8786 1487.4875 1533.4038 1568.9207 1570.4930 1588.2141 1589.8584 1593.6802 1609.3429 1618.8843 2973.1315 2977.7858 2979.3926 2985.9793 2991.3480 2995.6679 3019.4164 3037.6188 3056.1742 3060.7098 3079.0373 3093.5858 3094.1092 3104.8674 3140.2273 3142.3704 3142.8404 3155.1137 3166.2869 3169.0093 3174.6926 3552.4214 3566.6461 3707.1532 3728.4442
redmass: 7.5302 7.5768 7.7385 4.5802 6.7436 5.1039 5.2097 6.1252 6.7382 5.8754 5.6420 2.2366 3.6605 4.3120 5.8523 4.7773 4.2955 5.8823 7.0418 6.0076 6.1167 1.3356 4.7546 3.3686 1.0588 4.1465 3.5405 3.1734 3.5249 2.8947 6.1716 3.4013 5.0549 5.4144 2.8336 3.2160 1.2722 1.2409 2.8790 3.5777 3.7711 11.2371 3.0535 3.5861 2.2400 2.2580 3.2224 3.8850 1.2676 1.9226 3.5983 6.4201 4.4821 6.8213 5.8806 5.3525 4.0002 7.5351 5.8707 3.4535 10.0717 2.4742 1.4481 3.6552 2.3768 3.2512 1.4593 1.6451 1.2710 10.1905 2.2895 3.0211 1.6847 1.5559 1.5150 1.8389 1.3747 2.7311 1.3443 1.3976 4.6321 1.5149 13.1058 2.9429 4.8815 3.0657 2.4529 2.4095 2.4796 2.1767 1.9097 1.5106 2.1108 1.3848 2.0237 1.2286 1.5797 1.2001 1.5267 2.5834 2.5550 3.4075 1.4074 1.5281 1.4545 2.0929 1.1454 1.2454 1.3619 1.4291 2.4358 2.4845 1.2304 1.2719 7.2084 3.6640 2.5440 4.1497 3.8794 1.0805 1.3500 1.4922 1.2685 1.6633 1.0744 1.2553 1.1621 1.0703 1.1023 2.5743 3.7203 2.3225 5.9452 7.2800 6.2362 2.3209 2.0670 1.0598 1.0604 1.0351 1.0602 1.0351 1.0625 1.0966 1.1013 1.1026 1.1034 1.0999 1.1006 1.1002 1.0992 1.0894 1.0921 1.0894 1.0884 1.0957 1.0971 1.0973 1.0445 1.0438 1.1053 1.1058
irintensity: 0.0999 0.5189 0.1120 0.5937 0.8489 0.1562 0.8321 1.3358 0.2595 1.0353 0.5035 0.2288 0.5200 1.0082 1.6607 1.4408 2.2014 5.1076 0.9969 2.0819 1.7398 1.1486 1.9743 5.3320 0.5796 7.3301 0.7201 7.7000 3.6219 0.7034 3.4830 6.7690 1.9408 3.3772 1.5477 0.2905 70.4274 333.9609 0.0775 11.4324 8.0932 69.9332 3.2125 10.8023 75.4067 14.0337 10.6132 2.1079 21.3871 25.9105 43.5278 144.5726 5.3137 0.6442 10.9072 26.8099 8.9962 11.0909 2.7188 1.3065 28.4994 2.2505 5.5411 7.1413 26.1249 27.8851 28.2178 36.4926 1.5357 70.6807 28.2037 8.2805 5.5569 2.5796 4.2561 7.9197 1.4545 1.3096 0.0306 2.3776 0.5105 1.5244 73.6549 11.7380 51.7678 13.5225 34.4665 31.8484 5.4151 1.8941 1.5004 15.4883 1.9255 1.4760 39.4656 3.4229 15.9000 7.4406 13.9096 25.1786 5.7429 17.7789 10.5760 16.3450 17.6528 55.9777 13.2110 1.1196 2.8817 2.1576 0.6233 10.3839 42.7894 19.8487 7.2207 138.8608 13.6628 246.8153 116.0281 3.7725 45.9147 62.5115 39.9746 8.2832 3.7894 5.7190 33.0537 20.4661 13.0920 240.6088 124.7857 97.1112 23.2418 1.0947 71.6292 587.9978 431.5947 3.0677 10.8171 20.2822 67.7244 23.7026 21.0214 2.1428 5.5692 43.2617 42.8488 24.3760 32.5384 11.1997 27.5515 10.8298 3.7315 4.5615 2.6502 0.2375 8.5167 3.1155 59.5567 88.5741 48.8238 38.4857
temp: 298.150 k
press: 1.00000 atm
elementType: 17 16 9 8 8 7 7 7 7 7 6 6 6 6 6 6 6 6 6 6 6 6 6 6 6 6 6 6 6 6 6 1 1 1 1 1 1 1 1 1 1 1 1 1 1 1 1 1 1 1 1 1 1 1 1 1
symmnumber: 1
zpe: 1136910.7 jmol-1
zpe.correction: 0.433026 hartree
zpe.thermalcorrener: 0.464971 hartree
zpe.thermalcorrenthalpy: 0.465915 hartree
zpe.thermalcorrgfe: 0.363582 hartree
zpe.sumelectzpe: -2194.970903 hartree
zpe.sumelectthermal: -2194.938958 hartree
zpe.sumelectthermalent: -2194.938014 hartree
zpe.sumelectthermalfe: -2195.040347 hartree
dipole: 8.2734 -5.0224 -2.1510
dipole: 9.9147
quadrupole: -241.4737 -197.9108 -189.1866
quadrupole: 17.7615 7.0113 2.6192
quadrupole: -31.9500 11.6129 20.3371 17.7615 7.0113 2.6192
hfenergy: -2195.4039293 hartree
pointgroup: C01[X(C21H25Cl1F1N5O2S1)]
dipole: 3.1362143 2.2023938 0.727508 debye
polarizability: 314.4673243|52.0099377|381.6339134|-22.4702734|0.5923298|244.5027131 unknown
InChI: InChI=1S/C21H25ClFN5O2S/c1-21(2)27-19(24)26-20(25)28(21)16-9-12-18(22)15(13-16)6-4-3-5-14-7-10-17(11-8-14)31(23,29)30/h7-13H,3-6,24-25H2,1-2H3
charge 0 multiplicity 1
56 atoms
Cl 3.650714 4.532706 -0.890995
S  -6.074372 -1.095682 0.188059
F  -7.26086 -0.20384 -0.934648
O  -5.546664 -2.359486 -0.652022
O  -6.844476 -1.253542 1.590122
N  2.752275 -1.44164 -0.238802
N  1.097263 -3.288534 -0.297671
N  3.207858 -3.490818 0.941165
N  4.688495 -1.698135 1.117032
N  1.5036 -5.066126 1.176814
C  1.653852 -2.163028 -1.060263
C  0.721883 3.783774 1.128073
C  2.110732 3.206604 1.539542
C  3.001514 -0.032627 -0.385027
C  -0.388606 2.713816 1.05614
C  2.694268 2.271319 0.493678
C  0.505731 -1.176727 -1.354885
C  2.288979 -2.688454 -2.377945
C  2.52723 0.867363 0.602816
C  -1.739583 3.291909 0.54783
C  3.52926 -2.238518 0.596499
C  3.696156 0.478748 -1.511448
C  3.382017 2.735552 -0.65657
C  -2.822307 2.229984 0.450982
C  3.886046 1.870893 -1.647304
C  1.913864 -3.903943 0.549659
C  -2.74509 1.22011 -0.54728
C  -3.906301 2.203417 1.36765
C  -3.72243 0.209501 -0.644838
C  -4.901373 1.2044 1.29804
C  -4.771669 0.236952 0.289365
H  0.817515 4.293639 0.149263
H  0.43731 4.562758 1.863236
H  2.802425 4.051274 1.712664
H  2.003648 2.663755 2.497801
H  -0.538271 2.259388 2.056364
H  -0.07307 1.893649 0.382844
H  -0.277516 -1.735459 -1.89335
H  0.071067 -0.80594 -0.410477
H  0.83464 -0.324474 -1.975109
H  1.533662 -3.273153 -2.931056
H  2.634037 -1.860051 -3.024012
H  3.141067 -3.353808 -2.151604
H  2.002614 0.458022 1.473512
H  -2.06545 4.106674 1.221794
H  -1.56922 3.7479 -0.447894
H  4.084338 -0.206598 -2.271059
H  4.421079 2.278955 -2.509698
H  -1.915492 1.2257 -1.263515
H  -3.978162 2.974644 2.14256
H  5.20781 -2.276352 1.772742
H  5.056294 -0.803656 0.804768
H  -3.666289 -0.572943 -1.407837
H  -5.738027 1.175821 2.002886
H  0.591718 -5.454504 0.954537
H  2.103669 -5.480788 1.883075
