program: Gaussian 09
title: 000279091
version: EM64L-G09RevD.01
frameworkgroup: C1[X(C10H7N3)]
method: RPBEPBE
basis: SDD
operation: Freq
keyword: #pfreq=noraman
keyword: PBEPBE/SDD
title: #p freq=noraman PBEPBE/SDD
converged: NO NO NO YES
title: Mulliken charges:
elementType: N N N C C C C C C C C C C H H H H H H H
charge: -0.493965 -0.100187 -0.020377 0.003559 0.501064 0.430346 0.062396 -0.483425 -0.460150 -0.442595 -0.365494 -0.187447 -0.203681 0.241116 0.241798 0.232289 0.259626 0.226551 0.230300 0.328275
chargesum: 0.00000
title: Mulliken charges with hydrogens summed into heavy atoms:
elementType: N N N C C C C C C C C C C
charge: -0.165690 -0.100187 -0.020377 0.003559 0.501064 0.430346 0.062396 -0.242309 -0.218351 -0.210306 -0.105869 0.039104 0.026619
polarizability: 1.79556891e+02 -4.40778687e+00 1.57395774e+02 1.26651100e-03 -4.81477496e-03 5.00006277e+01
1716.lowfreq: -4.7627 0.0004 0.0005 0.0007 4.3273 5.9049 136.2616 163.3683 213.0911
frequency: 136.2580 163.3679 213.0908 252.0867 407.0560 418.4954 457.6537 470.2305 476.4286 483.5252 519.2935 575.7217 597.8614 623.8957 634.4327 663.4381 763.6377 771.6378 777.1626 797.8150 833.6344 848.9866 869.7738 913.5122 929.8110 970.0738 987.2848 1013.4537 1035.9970 1072.7340 1114.7104 1172.6852 1185.2385 1206.1503 1238.7982 1278.3324 1279.2085 1378.3048 1387.9491 1421.3953 1436.5264 1454.5476 1484.3804 1515.8022 1591.2590 1592.3707 1639.2031 3130.1391 3131.5837 3144.1233 3153.0485 3162.0112 3175.7965 3576.5968
redmass: 6.3110 4.3004 5.1366 3.7252 5.0267 5.3522 4.3471 8.5814 3.7681 7.7805 3.8403 7.5900 6.9456 1.3259 3.3570 3.1049 1.4013 1.7653 5.5800 6.5788 2.2590 6.3643 1.5146 1.4672 7.0284 1.3310 1.3593 5.5458 3.0611 1.7999 2.3671 1.2498 1.2877 1.7413 2.0011 1.7866 4.6887 3.0489 5.7308 1.9898 4.5727 3.1749 1.9487 4.3225 5.7712 8.2257 7.2677 1.0859 1.0868 1.0920 1.0941 1.0992 1.0965 1.0793
irintensity: 4.7515 0.4361 5.5443 3.6347 2.9078 5.2289 0.0925 1.0843 0.1565 0.3874 3.1807 0.3000 2.0995 86.1160 0.8995 0.3618 48.5706 55.4186 2.2587 4.4507 83.8111 19.8331 9.1014 0.3847 47.6019 1.1435 3.3570 21.7236 3.9770 1.7826 13.1365 1.3057 16.3333 0.0618 0.9105 0.1602 110.3037 26.8869 4.9333 4.7198 12.4585 1.3718 33.7289 7.5824 5.0531 71.6932 62.9983 4.7840 1.8567 15.7325 25.0625 22.9571 8.5608 70.1010
temp: 298.150 k
press: 1.00000 atm
elementType: 7 7 7 6 6 6 6 6 6 6 6 6 6 1 1 1 1 1 1 1
symmnumber: 1
zpe: 391947.5 jmol-1
zpe.correction: 0.149285 hartree
zpe.thermalcorrener: 0.157949 hartree
zpe.thermalcorrenthalpy: 0.158894 hartree
zpe.thermalcorrgfe: 0.115666 hartree
zpe.sumelectzpe: -548.608756 hartree
zpe.sumelectthermal: -548.600092 hartree
zpe.sumelectthermalent: -548.599148 hartree
zpe.sumelectthermalfe: -548.642375 hartree
dipole: -2.6409 -2.2022 0.0005
dipole: 3.4386
quadrupole: -63.4479 -74.0608 -79.2057
quadrupole: -10.2883 0.0001 0.0011
quadrupole: 8.7903 -1.8227 -6.9676 -10.2883 0.0001 0.0011
hfenergy: -548.7580414 hartree
pointgroup: C01 [X(C10H7N3)]
dipole: -1.270989 0.4635014 0.000191 debye
dipolederiv: -1.0326228 0.4810529 0.0000215 -0.1210978 -0.4761901 0.0000745 0.0001471 0.0001113 -0.2377726 -0.1111308 -0.0073228 -0.000013 0.2774453 -0.50757 -0.000003 -0.0000023 -0.0000404 -0.1769144 0.354913 -0.7221916 0.0000052 -0.6212734 0.6849434 -0.000002 -0.0000615 0.0000466 -0.1470759 -0.025056 0.1825264 -0.0000066 -0.0785096 -0.226558 0.0000114 -0.0000238 0.0000089 0.0020003 -0.0199418 -0.3625388 0.0000169 -0.3387107 0.2164287 0.0000021 0.0000163 0.0000019 0.0914638 0.8809175 0.1998968 -0.0000286 0.1691297 0.0702182 -0.0000342 -0.0000399 -0.0000539 0.1457086 -0.0452654 -0.0988673 0.0000051 0.2607523 0.2489917 -0.0000283 0. -0.0000068 0.1190471 -0.0470689 0.2530614 -0.0000145 0.1039256 -0.3564912 0.000003 -0.0000132 -0.0000003 -0.2383505 -0.0503514 0.1122927 0.0000018 0.3056331 -0.2059502 -0.0000044 -0.0000016 0.0000099 -0.2023582 -0.4517989 -0.2001992 0.0000185 0.202745 0.0413622 -0.0000102 0.0000009 0.0000173 -0.2577685 -0.0355404 -0.0394149 -0.0000107 -0.2736657 -0.1718952 0.0000139 0.0000081 0.0000197 -0.1802998 0.2378069 0.1993367 -0.0000134 -0.0057213 0.3132164 -0.0000197 0.000004 -0.0000325 -0.1250787 0.2284966 -0.0610941 -0.0000112 0.0866078 0.2160767 -0.0000226 -0.000023 -0.0000302 -0.1427696 -0.0619613 -0.0433841 0.0000074 -0.1046295 0.0323269 0.0000073 0.0000101 0.0000062 0.171554 -0.0630264 -0.1030195 0.0000056 -0.0404742 0.0414427 0.0000047 0.0000017 0.0000052 0.1630145 0.0785066 -0.0554044 0.0000013 -0.0186287 -0.1063091 0.0000076 0.0000039 0.0000016 0.1877548 -0.0198887 0.0762674 0.0000067 0.0459146 0.070089 0.0000023 0.0000122 0.0000031 0.1718133 -0.0685643 0.1093244 0.0000003 0.1082182 0.0311506 0.0000031 -0.0000039 0.0000022 0.1561468 0.0996014 -0.0059037 0.0000016 -0.0053984 -0.1379504 0.0000137 0.0000011 0.0000123 0.1571053 0.1519753 0.0855817 0.0000062 0.0477377 0.2226677 -0.0000191 -0.0000363 -0.0000819 0.3427797 unknown
polarizability: 159.1551769|-7.4379721|177.7974877|-0.0035279|-0.0035129|50.0006277 unknown
InChI: InChI=1S/C10H7N3/c1-3-7-4-2-6-9-10(7)8(5-1)11-13-12-9/h1-6,11H
charge 0 multiplicity 1
20 atoms
N  1.321442 1.981209 -0.000135
N  2.476431 -0.05635 -0.000188
N  2.531339 1.250729 -0.000187
C  -0.029841 0.004853 -0.000034
C  -1.296481 -0.673998 0.000023
C  0.019947 1.438324 -0.000059
C  1.201768 -0.732851 -0.000076
C  -2.492296 0.122247 0.000028
C  -1.280102 -2.110429 0.000076
C  -1.15534 2.201622 -0.000074
C  1.185601 -2.134712 -0.000011
C  -2.4108 1.519511 -0.000014
C  -0.068081 -2.814705 0.000073
H  -3.4676 -0.376171 0.000069
H  -2.23294 -2.65187 0.000101
H  -1.117985 3.296223 -0.000104
H  2.134416 -2.678617 -0.000037
H  -3.330358 2.115071 -0.000021
H  -0.078123 -3.909978 0.000127
H  1.486002 2.98779 0.000042
