program: Gaussian 09
title: 000279118
version: EM64L-G09RevD.01
frameworkgroup: C1[X(C16H16O3)]
method: RPBEPBE
basis: SDD
operation: Freq
keyword: #pfreq=noraman
keyword: PBEPBE/SDD
title: #p freq=noraman PBEPBE/SDD
converged: YES YES NO NO
title: Mulliken charges:
elementType: O O O C C C C C C C C C C C C C C C C H H H H H H H H H H H H H H H H
charge: -0.470780 -0.414035 -0.239955 0.027194 -0.468228 0.364924 0.379035 -0.487688 -0.359644 -0.386104 -0.432401 -0.405451 0.166743 -0.229344 -0.236212 -0.241291 -0.224925 -0.241075 -0.244297 0.235579 0.221675 0.274371 0.273604 0.264519 0.240532 0.256136 0.288536 0.348875 0.227992 0.225235 0.227607 0.225336 0.230478 0.227354 0.375705
chargesum: 0.00000
title: Mulliken charges with hydrogens summed into heavy atoms:
elementType: O O O C C C C C C C C C C C C C C C C
charge: -0.121905 -0.038330 -0.239955 0.027194 -0.010973 0.364924 0.379035 0.060287 -0.095125 -0.145572 -0.176265 -0.116916 0.166743 -0.001352 -0.010977 -0.013684 0.000410 -0.010596 -0.016943
polarizability: 1.86280339e+02 -1.97500125e+01 1.91745625e+02 -8.17619291e+00 1.59754354e+01 1.41118064e+02
1716.lowfreq: -8.6971 -6.2768 -0.0009 -0.0008 -0.0006 6.9501 20.9274 30.0370 43.7569
frequency: 20.7689 29.9987 43.7415 45.5363 61.8908 67.1149 112.1432 169.0084 191.5894 210.9543 217.8654 261.9406 287.3169 298.2950 319.8575 349.9625 400.7689 403.3963 427.2200 458.4053 488.6517 511.0738 541.4771 569.8634 611.7470 616.1550 617.3349 638.3494 643.9351 703.9753 705.3900 710.6012 764.9263 775.1003 788.3386 845.1186 856.3479 861.1718 888.9842 919.3281 932.2879 944.7715 981.7260 983.9302 990.1014 990.6651 998.9575 999.9829 1019.8286 1028.7522 1031.5595 1046.2481 1060.4968 1085.1929 1096.5131 1107.2454 1151.6831 1155.8031 1172.0332 1173.3518 1189.0204 1194.2702 1203.7209 1237.3420 1264.2371 1307.5596 1313.0317 1322.1580 1339.0861 1373.2805 1381.5360 1383.5638 1434.0685 1434.9638 1439.7959 1464.4321 1481.4491 1482.8922 1589.7391 1591.9490 1609.8411 1613.5824 1661.4007 2995.2747 3001.4470 3048.8660 3069.6965 3118.7319 3125.0080 3127.8095 3133.8915 3141.2174 3146.8103 3155.4376 3158.5581 3166.9289 3176.2222 3510.5011 3564.8687
redmass: 11.4667 3.9568 4.7570 4.3306 4.7116 5.6363 2.9571 2.7547 5.8084 4.9349 5.6194 4.9351 2.6899 1.5862 3.7905 2.9549 2.8139 2.8658 4.4392 3.8275 3.6904 1.8789 3.9850 3.8183 4.4961 6.1643 6.2432 5.2146 1.3893 3.8642 1.7082 1.9132 1.8242 1.8593 1.7760 3.4584 1.2804 1.2485 2.8638 2.1519 1.4647 2.2173 1.3893 1.4342 5.5382 5.6484 1.3148 1.3216 3.0626 2.1752 2.5333 2.2796 2.2816 1.5968 2.2633 2.1940 1.5642 1.4132 1.0587 1.0534 1.1492 1.1268 3.0509 1.4338 1.3976 1.4513 1.4469 1.3745 1.6678 2.5252 7.9159 3.6584 2.0578 2.1948 1.1327 1.1225 2.2761 2.0863 6.0026 6.2973 6.0077 6.0427 7.9685 1.0615 1.0608 1.0977 1.1002 1.0856 1.0847 1.0878 1.0880 1.0936 1.0926 1.0955 1.0986 1.1010 1.0956 1.0639 1.0659
irintensity: 1.2475 0.1200 0.0864 0.0237 0.0708 1.1478 2.8471 0.7779 3.9797 3.5952 0.5732 0.8800 25.7998 90.4238 23.3175 36.2293 1.3536 0.4888 6.7502 13.1579 9.2130 30.3068 39.1241 31.6844 24.6601 3.8399 2.2496 11.9475 111.4594 6.2395 61.0510 63.0673 57.3782 15.1818 17.5418 7.5290 0.5533 0.2784 44.3680 2.7269 1.9989 6.9900 0.2373 0.2498 1.7859 0.3802 0.2340 1.5602 48.7765 8.9123 106.7380 31.3659 114.4107 0.8361 48.3373 4.5459 49.2756 1.4467 0.5120 0.0431 2.5225 3.1224 12.1285 13.9291 8.5705 23.8481 30.2696 14.5533 81.0708 26.1144 1.6332 6.4026 6.5113 28.8563 22.8259 11.4962 21.2283 8.6578 1.3451 0.2747 5.0574 2.7647 193.4976 8.0323 29.2124 4.8610 17.1218 4.3663 0.6360 3.3254 5.0796 31.5680 21.1139 29.0492 28.0058 16.6879 7.2685 21.0900 8.4592
temp: 298.150 k
press: 1.00000 atm
elementType: 8 8 8 6 6 6 6 6 6 6 6 6 6 6 6 6 6 6 6 1 1 1 1 1 1 1 1 1 1 1 1 1 1 1 1
symmnumber: 1
zpe: 731761.5 jmol-1
zpe.correction: 0.278713 hartree
zpe.thermalcorrener: 0.296108 hartree
zpe.thermalcorrenthalpy: 0.297052 hartree
zpe.thermalcorrgfe: 0.231085 hartree
zpe.sumelectzpe: -843.613516 hartree
zpe.sumelectthermal: -843.596122 hartree
zpe.sumelectthermalent: -843.595177 hartree
zpe.sumelectthermalfe: -843.661144 hartree
dipole: 0.9602 0.2057 -0.1557
dipole: 0.9943
quadrupole: -101.2202 -110.2384 -107.4571
quadrupole: -3.9076 -0.7851 -2.0242
quadrupole: 5.0850 -3.9332 -1.1518 -3.9076 -0.7851 -2.0242
hfenergy: -843.8922296 hartree
pointgroup: C01 [X(C16H16O3)]
dipole: -0.3729081 0.0915484 0.0746489 debye
polarizability: 186.9628393|19.5740802|191.0789506|-9.7404493|-15.3811662|141.1022377 unknown
InChI: InChI=1S/C16H16O3/c17-15(18)11-12-16(19,13-7-3-1-4-8-13)14-9-5-2-6-10-14/h1-10,17,19H,11-12H2
charge 0 multiplicity 1
35 atoms
O  0.052876 -0.294952 -2.026754
O  4.771285 -1.327713 -0.241915
O  3.275201 -2.972737 0.417708
C  -0.080512 -0.276724 -0.540254
C  1.018962 -1.200371 0.058204
C  -1.509362 -0.734822 -0.180166
C  0.154442 1.184274 -0.11195
C  2.431925 -0.780037 -0.378548
C  -2.598175 -0.038896 -0.772383
C  -0.068317 1.558087 1.237814
C  -1.787604 -1.818144 0.689263
C  0.620638 2.156591 -1.028304
C  3.473468 -1.814965 -0.016748
C  -3.928985 -0.418183 -0.505707
C  0.175773 2.880849 1.66559
C  -3.123643 -2.198503 0.959887
C  0.860338 3.483171 -0.600521
C  -4.197787 -1.50291 0.364024
C  0.642529 3.850322 0.746571
H  0.838552 -2.244737 -0.259721
H  0.957088 -1.185876 1.162132
H  2.729293 0.189039 0.060558
H  2.456927 -0.632574 -1.47654
H  -2.385397 0.803888 -1.439171
H  -0.452194 0.818619 1.951421
H  -0.973426 -2.37611 1.162134
H  0.781017 1.866282 -2.069892
H  -0.324567 -1.152295 -2.349845
H  -4.756345 0.1300 -0.970269
H  -0.004761 3.157177 2.710625
H  -3.321761 -3.038572 1.635096
H  1.218593 4.228104 -1.320283
H  -5.23153 -1.799092 0.574563
H  0.828967 4.878417 1.076936
H  5.428793 -2.039606 -0.012055
