program: Gaussian 09
title: 000279069
version: EM64L-G09RevD.01
frameworkgroup: C1[X(C17H16N2O4)]
method: RPBEPBE
basis: SDD
operation: Freq
keyword: #p
keyword: freq=noraman
keyword: PBEPBE/SDD
title: #p freq=noraman PBEPBE/SDD
converged: YES YES NO NO
title: Mulliken charges:
elementType: O O O O N N C C C C C C C C C C C C C C C C C H H H H H H H H H H H H H H H H
charge: -0.197735 -0.289710 -0.440160 -0.203688 -0.148610 0.032773 -0.225999 -0.295704 0.196275 -0.352304 -0.471448 -0.454555 0.290333 -0.194693 0.192003 -0.369360 -0.443350 0.438851 -0.056999 -0.405306 -0.325177 -0.246767 -0.224007 0.274753 0.296931 0.266166 0.234427 0.261095 0.260711 0.246156 0.305763 0.230298 0.237103 0.258540 0.351141 0.237261 0.266770 0.232946 0.235278
chargesum: 0.00000
title: Mulliken charges with hydrogens summed into heavy atoms:
elementType: O O O O N N C C C C C C C C C C C C C C C C C
charge: -0.197735 -0.289710 -0.089018 -0.203688 -0.148610 0.032773 0.048753 0.001227 0.196275 0.148289 0.050358 0.097364 0.290333 -0.194693 0.192003 0.098041 -0.184810 0.438851 -0.056999 -0.168045 -0.058408 -0.013821 0.011271
polarizability: 3.26915119e+02 -1.15762612e+01 1.81231126e+02 1.05029842e+00 1.93587194e+01 1.30969113e+02
1716.lowfreq: -9.4705 -3.8188 -0.0008 -0.0007 -0.0003 3.9500 19.6613 36.7089 42.8603
frequency: 19.1181 36.6732 42.8477 57.8180 84.8203 103.8456 122.5576 129.7634 154.8735 172.3673 189.4504 207.1106 236.8716 257.2519 270.6714 282.9594 295.6597 307.6754 327.6324 368.7113 399.8815 407.0670 449.6355 480.7286 513.0042 529.4039 536.2634 554.9294 580.2733 612.5760 633.5907 660.3781 671.9054 698.6218 707.8533 723.5385 756.4831 766.5154 797.4629 820.4480 829.6945 845.2586 877.2253 883.7431 891.4292 911.3983 941.2438 957.1493 968.9059 973.5907 995.3793 997.3142 1000.0004 1017.9168 1018.6111 1031.5349 1059.1148 1088.7735 1098.9935 1119.2918 1136.4722 1150.5632 1153.4794 1167.5751 1168.6256 1175.8086 1196.1640 1211.3251 1224.9023 1237.6485 1259.9855 1273.0107 1277.8673 1294.8814 1300.9012 1310.9035 1325.3799 1329.3853 1341.4493 1374.4481 1393.2242 1402.1409 1411.0320 1420.8844 1463.0192 1468.5219 1473.8519 1477.6390 1480.3092 1503.7698 1561.1611 1581.0026 1622.6385 1631.3646 1696.0639 2976.6542 2978.6045 2982.9219 3005.4524 3024.4941 3033.6903 3038.3356 3042.6740 3088.9946 3122.0850 3123.8389 3129.3611 3139.0519 3156.8972 3171.3735 3566.3238
redmass: 6.0347 7.0584 4.8348 6.7937 5.8823 4.3407 3.9772 4.3417 3.6426 4.8138 6.3397 4.3689 2.8524 3.7795 3.1015 5.3213 3.3117 1.4221 5.0690 3.6649 3.6514 4.5771 5.2461 2.9063 6.2743 6.1830 3.2964 4.7650 5.6250 6.6862 4.5617 7.5338 3.5119 7.9299 7.4229 5.4785 5.7550 1.2712 2.7979 4.6850 2.9409 4.1542 1.4703 3.6974 5.5111 1.5802 1.9706 5.2953 1.3918 2.6482 2.1723 1.4328 1.9098 1.8486 2.1553 3.5563 2.8195 1.9422 2.4786 2.7894 3.2911 1.8085 1.8508 1.0912 1.1854 1.0981 1.3612 1.6634 1.3103 2.4347 2.6456 1.4941 1.1960 1.7742 1.5242 1.4876 1.7007 1.4051 1.5484 1.1990 3.6556 3.3610 5.3543 5.0259 3.1855 1.0880 1.1036 1.0920 1.1055 3.7625 8.1209 7.7964 6.5784 7.8766 12.7953 1.0574 1.0819 1.0600 1.0627 1.1024 1.1056 1.0616 1.0821 1.1031 1.0878 1.1092 1.0929 1.0889 1.0946 1.0997 1.0664
irintensity: 0.2589 1.8289 0.9137 1.5688 1.9931 0.4606 6.7175 7.0740 2.7615 7.4407 0.5925 4.0230 6.9294 54.6389 6.8768 12.5998 14.0804 96.2826 1.7279 24.6298 0.1102 22.9036 5.0432 8.5382 0.2933 6.4952 0.2007 8.7551 16.4823 2.1947 4.5960 0.8135 0.2834 3.8227 5.7998 0.1595 12.2973 72.6387 6.4019 0.4586 7.0009 14.4767 12.9701 27.8988 2.0952 13.5675 17.2172 144.8017 3.8040 43.3467 3.1852 0.7543 4.5096 0.1871 7.4650 19.3937 58.1151 54.3906 0.7612 19.0837 19.3284 44.7068 45.0328 0.3135 6.4373 0.4263 4.3458 0.9834 13.2947 11.0566 28.2961 20.5327 6.8311 14.5700 10.8921 6.5511 7.8294 0.9111 13.0597 8.2183 82.1105 63.9887 211.6141 4.3760 6.8136 9.0575 4.4562 23.8686 12.0797 19.8554 4.8617 342.6122 2.7775 12.2327 368.6865 22.8341 4.2015 10.1150 37.1715 10.1103 11.9675 18.3065 15.1270 17.3566 3.1672 12.4099 8.6861 10.0759 21.5254 23.8316 9.4236
temp: 298.150 k
press: 1.00000 atm
elementType: 8 8 8 8 7 7 6 6 6 6 6 6 6 6 6 6 6 6 6 6 6 6 6 1 1 1 1 1 1 1 1 1 1 1 1 1 1 1 1
symmnumber: 1
zpe: 792848.7 jmol-1
zpe.correction: 0.301980 hartree
zpe.thermalcorrener: 0.321434 hartree
zpe.thermalcorrenthalpy: 0.322379 hartree
zpe.thermalcorrgfe: 0.252666 hartree
zpe.sumelectzpe: -1066.176236 hartree
zpe.sumelectthermal: -1066.156782 hartree
zpe.sumelectthermalent: -1066.155838 hartree
zpe.sumelectthermalfe: -1066.225550 hartree
dipole: 6.7694 1.4040 0.8393
dipole: 6.9642
quadrupole: -154.9192 -136.7515 -127.8939
quadrupole: 2.0379 -1.2234 0.9694
quadrupole: -15.0644 3.1034 11.9610 2.0379 -1.2234 0.9694
hfenergy: -1066.4782163 hartree
pointgroup: C01 [X(C17H16N2O4)]
dipole: -2.6327204 0.493024 -0.5770437 debye
polarizability: 326.5229056|12.5156326|172.523973|9.5299255|-26.4106168|140.0684795 unknown
InChI: InChI=1S/C17H16N2O4/c20-8-12-13(9-23-17(12)22)16(21)19-6-11-5-10-3-1-2-4-14(10)18-15(11)7-19/h1-5,12-13,20H,6-9H2
charge 0 multiplicity 1
39 atoms
O  5.233634 0.337117 1.77531
O  2.449239 1.950243 -0.745253
O  2.272819 -2.030054 -1.147832
O  6.309753 -1.346073 0.584543
N  0.675816 0.733428 0.101385
N  -2.392517 -1.069161 0.876353
C  3.005423 0.169777 0.823714
C  4.009909 -0.605954 -0.071823
C  2.017259 1.006344 0.000712
C  3.947165 1.08813 1.650191
C  -0.288938 1.55405 -0.692234
C  0.043271 -0.433117 0.78045
C  -1.613687 0.88725 -0.409082
C  -1.42433 -0.257551 0.438493
C  5.315452 -0.621048 0.744462
C  3.571569 -2.03181 -0.456285
C  -2.899915 1.206986 -0.826859
C  -3.987007 0.37347 -0.393008
C  -3.688999 -0.763155 0.462739
C  -5.346293 0.619829 -0.769823
C  -4.757104 -1.605232 0.903398
C  -6.370531 -0.219423 -0.324187
C  -6.073647 -1.338859 0.517067
H  2.49332 -0.542643 1.492622
H  4.200178 -0.008514 -0.988406
H  4.147351 2.030166 1.112526
H  3.596729 1.284801 2.674151
H  -0.008543 1.541202 -1.763518
H  -0.245634 2.611276 -0.36865
H  0.197195 -0.412999 1.876078
H  0.445685 -1.383272 0.379757
H  3.405226 -2.643412 0.445971
H  4.357674 -2.516937 -1.066547
H  -3.10208 2.070464 -1.471592
H  2.379594 -1.634416 -2.049556
H  -5.572678 1.477579 -1.414815
H  -4.502329 -2.453983 1.545332
H  -7.407633 -0.024314 -0.61761
H  -6.887097 -1.988479 0.857825
