program: Gaussian 09
title: 000025377
version: EM64L-G09RevD.01
frameworkgroup: C1[X(C7H8N4O3S)]
method: RPBEPBE
basis: SDD
operation: Freq
keyword: #p
keyword: freq=noraman
keyword: PBEPBE/SDD
title: #p freq=noraman PBEPBE/SDD
converged: NO YES NO NO
title: Mulliken charges:
elementType: S O O O N N N N C C C C C C C H H H H H H H H
charge: 0.304249 -0.186390 -0.218413 -0.227205 -0.165980 -0.397568 0.010401 0.087697 -0.070228 -0.404405 -0.671729 0.247335 -0.111311 -0.071988 -0.235038 0.261424 0.242435 0.246489 0.343054 0.229247 0.237320 0.248990 0.301614
chargesum: 0.00000
title: Mulliken charges with hydrogens summed into heavy atoms:
elementType: S O O O N N N N C C C C C C C
charge: 0.304249 -0.186390 -0.218413 -0.227205 -0.165980 -0.054514 0.010401 0.087697 0.191196 0.084519 0.043828 0.247335 -0.111311 -0.071988 0.066575
polarizability: 2.35517761e+02 -3.02042966e-01 1.39456894e+02 -2.45548924e+00 7.21053873e+00 6.63747944e+01
1716.lowfreq: -3.2742 -0.0018 0.0011 0.0019 4.3376 9.4666 27.1545 59.1832 86.7139
frequency: 27.0667 59.1644 86.7111 96.9842 97.8029 151.9302 170.8290 184.8197 231.7004 239.7066 271.9608 310.3804 360.6419 426.3271 437.5955 481.7317 487.1593 500.2131 509.4492 596.1759 602.5334 662.8928 671.6765 693.4105 701.0480 723.0853 730.1166 854.4790 859.5274 889.9304 946.4525 983.1315 1043.9009 1055.1039 1081.5564 1112.0440 1135.9248 1141.1685 1202.5074 1215.8063 1235.4831 1253.7946 1287.1746 1321.7331 1328.7697 1337.2155 1358.3085 1391.6176 1402.5345 1469.1704 1475.0786 1477.6346 1499.1361 1540.7932 1722.7047 2982.6717 2993.5366 3024.6202 3066.5918 3094.2316 3101.8055 3213.2439 3612.8554
redmass: 8.2170 6.9132 6.1814 6.9040 6.2492 5.5332 4.0340 7.0539 1.9457 1.7832 8.4359 6.9394 3.7480 3.5119 7.9157 2.6356 6.7534 2.0270 2.7064 10.6460 7.8597 5.1613 11.6064 7.1055 10.5046 5.9064 6.0563 5.2886 3.2977 1.4229 1.4499 2.0108 2.1320 9.8454 2.3345 1.9917 2.1212 3.1388 3.9518 1.5149 3.9032 1.5919 1.9259 2.8152 1.6978 5.1532 2.0730 1.3123 1.4999 1.0570 6.3775 1.0571 1.0905 11.1051 9.8254 1.0660 1.0360 1.0863 1.1004 1.1001 1.1009 1.0961 1.0797
irintensity: 1.8076 0.0372 0.1759 1.6065 3.0849 1.9384 3.3838 1.8081 0.1981 0.9778 3.0275 4.2889 3.2949 15.2484 6.8808 16.4624 6.1264 90.9418 47.7404 2.0006 5.9272 30.9980 11.4837 3.5028 22.6804 4.2719 36.3299 2.8192 33.2764 17.5481 5.7082 8.8241 121.4765 14.9014 107.1217 15.5732 25.9762 85.9558 850.0961 163.3441 26.3220 7.5774 1.8729 30.8571 68.2036 91.7431 142.1575 31.3019 31.2890 16.5361 334.8763 11.0868 17.3366 695.2039 389.6222 56.2387 12.8568 13.6065 22.8209 21.6380 14.5470 3.9317 101.9186
temp: 298.150 k
press: 1.00000 atm
elementType: 16 8 8 8 7 7 7 7 6 6 6 6 6 6 6 1 1 1 1 1 1 1 1
symmnumber: 1
zpe: 420040.9 jmol-1
zpe.correction: 0.159985 hartree
zpe.thermalcorrener: 0.173870 hartree
zpe.thermalcorrenthalpy: 0.174814 hartree
zpe.thermalcorrgfe: 0.117981 hartree
zpe.sumelectzpe: -1113.085314 hartree
zpe.sumelectthermal: -1113.071429 hartree
zpe.sumelectthermalent: -1113.070484 hartree
zpe.sumelectthermalfe: -1113.127317 hartree
dipole: 8.9582 -4.0346 -1.1204
dipole: 9.8885
quadrupole: -99.2554 -102.1946 -91.9452
quadrupole: -15.9018 -5.3535 -1.9766
quadrupole: -1.4571 -4.3962 5.8532 -15.9018 -5.3535 -1.9766
hfenergy: -1113.2452988 hartree
pointgroup: C01 [X(C7H8N4O3S1)]
dipole: -3.5071712 1.6341499 -0.406091 debye
dipolederiv: -0.1298682 -0.1048351 0.0025914 -0.3248968 -0.3565841 0.0511757 0.0244399 0.0546211 0.1180907 -0.5826159 -0.0531971 -0.0287651 -0.3203726 -1.1156951 0.1615386 0.0035202 0.1957439 -0.3568013 -1.0853644 0.181789 -0.0074738 0.4722207 -0.5322372 0.0261539 -0.0464327 0.0300556 -0.241497 -0.6741954 -0.1336961 0.0206381 -0.4327241 -0.7217852 0.0592782 0.0528057 0.0528878 -0.252199 -2.7042112 -0.1674532 0.0141572 -0.4451896 -0.7546965 -0.0376132 -0.0399442 0.0178668 -0.2296414 -1.2302283 0.3051758 -0.1131506 0.2957218 -0.6343066 0.1018311 -0.0371751 0.0092508 -0.5375576 -1.3901955 0.1176167 0.0087559 0.9286203 -0.6240883 0.0229011 -0.0982255 0.0358756 -0.1926746 2.3791645 0.1102495 -0.0408073 0.3255224 1.0377873 -0.0958248 -0.05399 -0.0886257 0.2468682 0.2677557 -0.1740383 -0.0522999 -0.31205 0.4708688 0.1026476 0.0284916 0.0521581 0.3087144 0.0802304 0.0239762 -0.0723427 -0.2081282 0.4533532 -0.1493831 0.0002446 -0.0720295 0.370671 -0.025034 0.0023262 -0.0116277 0.0787238 -0.0213893 -0.069083 -0.0609266 -0.0852592 -0.0928842 2.3181782 0.0456761 0.2143217 0.9595217 1.6767818 -0.2803793 0.062419 -0.3030769 0.3727728 2.325894 0.0296595 -0.0510707 -0.8107515 0.7034855 -0.0470962 0.1315322 -0.0514703 0.0518005 -1.0760417 -0.3029151 0.0417274 -0.957928 -0.0220185 0.0065371 0.1224418 -0.0101513 -0.0976349 1.063625 0.0946739 -0.0233919 0.5029755 0.2126413 -0.0312562 -0.0617996 -0.0201337 0.0149486 -0.0050268 -0.0593206 0.0820781 0.01272 -0.0023451 0.022047 0.0637523 0.0158116 -0.0301851 -0.0043101 0.0921079 0.0449981 0.1246473 -0.0535161 -0.0066882 0.0822601 -0.053856 0.0502349 0.0816133 -0.0377752 -0.0037279 0.0290628 -0.0109127 0.0170047 -0.1006341 0.0767222 -0.1785202 0.281106 -0.005961 -0.02508 0.0350143 0.1509059 0.0538559 -0.0630202 0.0607913 0.3525009 0.0560667 0.090732 -0.0042609 0.1166093 -0.1050695 0.0108456 0.0041028 0.0325044 0.0669188 0.0208909 -0.0306404 0.0920901 -0.0931272 0.0393649 0.0743846 0.0513635 0.0309247 0.0129246 -0.059016 -0.032549 -0.0874859 -0.0257137 0.1091518 -0.0004687 -0.0645749 0.0098264 0.0614284 0.091583 0.0083982 0.0001266 0.0495218 0.1003039 0.0075914 -0.0006509 0.009562 0.1817215 unknown
polarizability: 235.522596|-1.642661|139.4925038|0.7429096|-7.1722062|66.3343494 unknown
InChI: InChI=1S/C7H8N4O3S/c1-4-2-8-6(12)10(4)7-9-3-5(15-7)11(13)14/h3-4,8H,2H2,1H3
charge 0 multiplicity 1
23 atoms
S  1.094604 1.150123 -0.16876
O  -2.438457 -2.193022 0.336572
O  4.618642 -0.759118 -0.001277
O  4.063864 1.462579 -0.237479
N  -1.465384 0.002823 -0.058452
N  -3.695412 -0.273447 -0.253061
N  0.437275 -1.473963 0.11311
N  3.75622 0.205684 -0.098724
C  -2.023605 1.385578 -0.189723
C  -3.466451 1.102349 -0.711746
C  -2.019097 2.135064 1.159437
C  -2.539445 -0.988311 0.04143
C  -0.122003 -0.266874 -0.009522
C  2.368346 -0.134645 -0.050279
C  1.815251 -1.404869 0.090439
H  -1.438469 1.942649 -0.944185
H  -4.188315 1.808007 -0.267266
H  -3.522227 1.17998 -1.815133
H  -4.590519 -0.756095 -0.298274
H  -2.395533 3.163884 1.017384
H  -2.668988 1.619468 1.888278
H  -1.00314 2.200852 1.583846
H  2.408843 -2.315196 0.179784
