program: Gaussian 09
title: 000279032
version: EM64L-G09RevD.01
frameworkgroup: C1[X(C12H11Cl2N5)]
method: RPBEPBE
basis: SDD
operation: Freq
keyword: #p
keyword: freq=noraman
keyword: PBEPBE/SDD
title: #p freq=noraman PBEPBE/SDD
converged: YES YES NO NO
title: Mulliken charges:
elementType: Cl Cl N N N N N C C C C C C C C C C C C H H H H H H H H H H H
charge: 0.018370 -0.014339 -0.069041 -0.074231 -0.058166 -0.108862 -0.571194 -0.112542 0.189761 0.191419 -0.733948 -0.763376 -0.064176 0.299010 -0.260301 -0.295713 -0.065014 -0.194196 -0.235713 0.249845 0.238692 0.249749 0.240765 0.244544 0.241428 0.279662 0.237086 0.261705 0.339029 0.339745
chargesum: 0.00000
title: Mulliken charges with hydrogens summed into heavy atoms:
elementType: Cl Cl N N N N N C C C C C C C C C C C C
charge: 0.018370 -0.014339 -0.069041 -0.074231 -0.058166 -0.108862 0.107580 -0.112542 0.189761 0.191419 0.004339 -0.036638 -0.064176 0.299010 -0.260301 -0.016051 -0.065014 0.042890 0.025992
polarizability: 4.31623145e+02 -2.29061092e+01 2.05673266e+02 -2.65869679e-01 1.93796046e-01 7.79830872e+01
1716.lowfreq: -2.8300 -0.0022 -0.0017 -0.0006 2.9316 5.3373 14.8420 33.1773 54.4054
frequency: 13.8566 33.1473 54.3950 55.4244 92.2714 119.9761 152.8737 163.3627 184.6268 188.4495 199.4086 199.7842 209.6016 229.1671 282.9896 303.7995 319.6624 335.6640 390.6807 404.6172 431.7206 487.6807 504.9501 512.5302 530.3953 532.8904 556.1084 561.6864 571.5829 584.7454 593.5132 673.5631 681.0918 708.6321 720.6669 794.8612 803.5543 825.0342 868.1499 911.5505 913.3553 932.8526 984.7707 1017.1839 1032.2137 1042.3647 1045.4287 1056.5694 1076.6431 1080.1283 1133.5686 1172.3042 1197.7115 1224.3067 1291.7836 1331.8196 1346.7795 1369.5886 1377.6187 1388.9900 1395.0279 1403.8404 1422.1269 1427.8926 1441.0075 1452.7523 1454.4518 1477.9478 1481.9747 1549.0234 1553.3867 1579.1694 1608.8415 2997.3403 3001.6345 3073.7583 3083.9066 3123.3378 3126.4988 3146.7244 3169.1563 3179.4810 3547.6317 3707.7797
redmass: 5.0160 6.2167 6.2664 6.7177 1.1564 4.2309 3.7834 6.7309 8.5667 3.7085 2.4296 13.7325 4.5213 2.1297 4.1187 2.6918 2.8012 7.3718 7.9501 7.2740 9.0688 4.6978 4.0157 7.1798 5.7287 1.2274 3.1643 5.1838 1.0702 4.8542 4.9053 7.0966 4.6054 7.5863 2.7911 1.8059 4.8910 8.1138 6.7695 1.3821 2.8189 2.2975 1.3354 6.4145 1.6479 1.6466 2.4307 2.6664 1.9278 1.8166 2.2580 1.5720 2.1713 5.6261 5.5017 6.7724 6.3649 8.4273 3.2545 1.3103 1.2494 3.0319 2.1455 1.4219 1.0468 1.0512 1.2663 5.4691 2.6300 4.6936 6.6842 7.1659 1.6233 1.0366 1.0367 1.0937 1.0960 1.1026 1.1009 1.0872 1.0919 1.0984 1.0442 1.1059
irintensity: 0.5024 0.7894 0.6337 1.1025 0.3626 1.3745 0.0767 0.1182 0.2027 11.7380 0.3252 0.0432 0.0249 2.6373 3.2529 9.5075 7.5636 3.4222 0.0610 0.8879 4.2854 8.3681 0.4247 23.7557 9.0155 277.8841 1.2064 0.9792 0.2630 18.6627 8.3438 12.5879 26.7742 13.8002 7.7089 70.6396 0.1420 39.3053 16.8144 0.7557 0.7728 12.3372 1.4340 26.7485 3.9379 7.6324 4.0689 18.8255 6.8075 0.2583 29.7554 2.6195 20.9040 13.4595 1.2084 314.9393 23.7031 1.1645 83.1685 15.8166 37.3696 71.8198 38.7385 36.3116 16.4034 16.2373 15.2215 141.3812 170.5935 491.9980 54.0443 3.8486 705.6712 2.8935 5.2693 4.6394 10.4868 22.5248 17.3595 7.9617 2.2626 10.6953 311.8509 53.8152
temp: 298.150 k
press: 1.00000 atm
elementType: 17 17 7 7 7 7 7 6 6 6 6 6 6 6 6 6 6 6 6 1 1 1 1 1 1 1 1 1 1 1
symmnumber: 1
zpe: 563497.0 jmol-1
zpe.correction: 0.214625 hartree
zpe.thermalcorrener: 0.232778 hartree
zpe.thermalcorrenthalpy: 0.233722 hartree
zpe.thermalcorrgfe: 0.166391 hartree
zpe.sumelectzpe: -1656.375678 hartree
zpe.sumelectthermal: -1656.357525 hartree
zpe.sumelectthermalent: -1656.356581 hartree
zpe.sumelectthermalfe: -1656.423911 hartree
dipole: 3.2643 2.3522 0.0356
dipole: 4.0237
quadrupole: -100.6847 -115.9562 -126.5544
quadrupole: -13.5824 -0.1220 0.0879
quadrupole: 13.7137 -1.5578 -12.1560 -13.5824 -0.1220 0.0879
hfenergy: -1656.5903027 hartree
pointgroup: C01 [X(C12H11Cl2N5)]
dipole: 1.1658976 -1.0696052 -0.0511032 debye
polarizability: 433.7248104|-4.0549958|203.4195575|-6.660862|1.9420503|78.1351298 unknown
InChI: InChI=1S/C12H11Cl2N5/c1-6-11(7(2)17-12(15)16-6)19-18-9-5-3-4-8(13)10(9)14/h3-5H,15H2,1-2H3
charge 0 multiplicity 1
30 atoms
Cl -2.5701 2.597068 0.160387
Cl -5.686693 1.65426 0.195111
N  3.556982 1.280491 -0.018339
N  3.913252 -1.154269 -0.024178
N  0.291609 -0.613197 0.038866
N  -0.608243 0.346326 0.061401
N  5.700349 0.352869 -0.05477
C  1.64568 -0.234244 0.015945
C  2.207021 1.1022 0.006028
C  2.570129 -1.345032 -0.000819
C  1.386885 2.362691 0.020042
C  2.091552 -2.776525 0.006622
C  4.346284 0.154007 -0.031765
C  -1.957327 -0.138398 0.078748
C  -2.993659 0.84059 0.122865
C  -2.317577 -1.515896 0.051328
C  -4.345864 0.43428 0.138618
C  -3.666602 -1.904809 0.067119
C  -4.692756 -0.93123 0.11087
H  0.733062 2.403658 0.909228
H  2.066448 3.228755 -0.001162
H  0.68744 2.394397 -0.833919
H  1.45587 -2.983616 -0.872144
H  2.964268 -3.446845 -0.000217
H  1.470492 -2.980171 0.896294
H  -1.505182 -2.247489 0.01749
H  -3.936035 -2.965682 0.045212
H  -5.747355 -1.220248 0.123117
H  6.319637 -0.454113 -0.065185
H  6.060332 1.304371 -0.060894
