program: Gaussian 09
title: 000279025
version: EM64L-G09RevD.01
frameworkgroup: C1[X(C14H17N5O2)]
method: RPBEPBE
basis: SDD
operation: Freq
keyword: #p
keyword: freq=noraman
keyword: PBEPBE/SDD
title: #p freq=noraman PBEPBE/SDD
converged: YES YES NO NO
title: Mulliken charges:
elementType: O O N N N N N C C C C C C C C C C C C C C H H H H H H H H H H H H H H H H H
charge: -0.233871 -0.268724 -0.068956 -0.074414 -0.078878 -0.087361 -0.578357 -0.104632 0.184339 0.186759 0.019742 0.212501 -0.428661 0.357269 -0.303839 -0.365420 -0.732811 -0.768173 -0.071299 -0.539794 -0.534246 0.290951 0.245264 0.250938 0.231549 0.249311 0.248832 0.241134 0.237637 0.237307 0.333523 0.334008 0.221095 0.221235 0.247735 0.222727 0.242818 0.222762
chargesum: 0.00000
title: Mulliken charges with hydrogens summed into heavy atoms:
elementType: O O N N N N N C C C C C C C C C C C C C C
charge: -0.233871 -0.268724 -0.068956 -0.074414 -0.078878 -0.087361 0.089173 -0.104632 0.184339 0.186759 0.019742 0.212501 -0.137711 0.357269 -0.058575 -0.114482 -0.003119 -0.052095 -0.071299 0.150272 0.154061
polarizability: 4.47212079e+02 1.22298919e+01 2.37475805e+02 -1.04280348e-01 1.84783916e-02 9.49706967e+01
1716.lowfreq: -5.2695 -4.7502 -0.0009 -0.0006 -0.0004 6.2805 15.2214 34.3324 46.3012
frequency: 15.2090 34.2857 46.2975 66.6243 78.1620 113.5763 119.6180 139.3058 145.2828 154.8979 163.8532 184.2003 190.7571 212.7297 230.1453 231.8108 255.2102 267.6489 274.3245 305.3902 326.0027 374.0210 379.9686 398.7822 427.5548 464.5105 493.0112 496.2205 498.4510 528.8888 548.0556 551.6964 559.0466 582.7277 608.5026 614.7527 641.5027 681.3862 686.4587 748.0022 750.6299 799.8919 807.4083 837.0859 898.6312 913.7265 916.2378 933.2500 947.8321 979.3047 1004.6335 1032.2480 1041.9501 1042.5683 1056.1697 1074.4795 1097.9941 1111.3111 1114.3388 1142.2228 1157.9963 1166.1443 1188.9502 1221.5843 1241.9314 1262.3227 1288.0096 1326.4562 1346.1847 1372.6633 1387.6257 1393.3358 1394.8493 1397.3270 1423.2851 1434.5413 1438.9840 1439.4970 1453.0366 1454.1518 1464.6391 1469.2555 1470.2190 1473.3711 1477.1251 1483.5567 1489.4571 1546.4643 1578.0215 1603.7545 1608.0724 2958.7922 2959.8515 2996.0101 2998.1228 3045.4016 3048.5675 3073.2835 3080.4168 3119.1148 3122.4120 3124.7507 3126.8204 3156.5576 3169.4973 3177.6209 3552.7934 3713.7275
redmass: 4.0660 4.4410 4.9658 3.1231 3.9008 1.8704 1.5047 4.4586 2.9660 2.7956 4.3154 2.4180 2.7034 2.9475 4.2848 1.4807 1.1861 2.1514 3.3155 2.6831 2.7545 5.1513 5.9265 5.6727 4.7539 4.7607 2.7289 6.5969 1.3284 4.7987 1.6354 4.8422 1.5690 4.5551 3.8690 4.6460 6.4447 4.8000 6.2411 6.4516 3.2173 6.1458 1.6277 7.4300 1.5717 3.2067 2.8337 1.3474 3.1198 8.4919 3.9150 1.6458 2.2384 1.6367 2.6453 1.9538 2.4843 1.2581 1.2610 1.4582 1.4048 1.4759 2.9857 4.6390 6.8632 1.6804 5.0624 7.0145 6.2101 3.1193 1.3376 3.2094 1.5462 4.1288 1.3611 1.2448 1.0469 1.1796 1.2148 1.0789 1.0494 1.2499 1.0509 1.1199 2.0018 6.2209 1.9527 4.4766 8.2484 2.1586 3.1465 1.0329 1.0330 1.0361 1.0364 1.1038 1.1039 1.0936 1.0961 1.1030 1.1009 1.0995 1.0993 1.0873 1.0896 1.0961 1.0440 1.1059
irintensity: 0.0189 1.2748 0.5530 4.7036 1.4177 0.5764 1.5243 1.7335 7.7995 0.4274 0.6327 6.9824 6.3958 1.2209 5.5610 0.0299 0.7002 0.0195 0.2592 10.4770 5.2762 1.0697 4.3354 3.1759 10.4495 16.6043 13.9049 20.1606 277.7673 10.0959 0.2910 13.5596 0.0384 3.2383 2.5567 1.1350 2.2691 20.5025 24.3881 1.9861 0.2770 3.7926 56.7984 1.7592 22.8577 8.9579 3.3624 0.0997 4.2839 37.0999 73.6586 4.4221 0.6231 6.9926 15.0356 2.8352 14.6726 0.1240 0.2172 35.7363 5.4282 55.0960 123.7470 97.0103 194.5782 55.6115 1.7411 102.5123 0.8821 21.2499 28.9980 10.4734 77.7407 25.0222 50.9700 30.3576 14.5161 2.2854 10.3610 13.7600 14.7048 244.9225 14.1664 52.7167 114.9250 224.0919 56.3286 529.6133 10.1750 642.5829 132.2244 80.8868 71.5645 6.3842 7.7872 46.3646 47.9536 5.1573 12.9204 27.8177 19.0336 32.7848 16.5284 6.6653 8.7171 17.6399 289.4277 49.2525
temp: 298.150 k
press: 1.00000 atm
elementType: 8 8 7 7 7 7 7 6 6 6 6 6 6 6 6 6 6 6 6 6 6 1 1 1 1 1 1 1 1 1 1 1 1 1 1 1 1 1
symmnumber: 1
zpe: 778872.7 jmol-1
zpe.correction: 0.296657 hartree
zpe.thermalcorrener: 0.317644 hartree
zpe.thermalcorrenthalpy: 0.318589 hartree
zpe.thermalcorrgfe: 0.246009 hartree
zpe.sumelectzpe: -966.302705 hartree
zpe.sumelectthermal: -966.281717 hartree
zpe.sumelectthermalent: -966.280773 hartree
zpe.sumelectthermalfe: -966.353353 hartree
dipole: 0.2383 0.3881 0.0127
dipole: 0.4555
quadrupole: -98.8293 -103.9090 -126.4556
quadrupole: 8.7481 -0.0699 -0.0412
quadrupole: 10.9020 5.8223 -16.7243 8.7481 -0.0699 -0.0412
hfenergy: -966.5993618 hartree
pointgroup: C01 [X(C14H17N5O2)]
dipole: -0.08029 0.1601145 0.0062317 debye
polarizability: 441.9987534|-29.2379342|240.8226681|-24.0661878|7.3495045|96.8371592 unknown
InChI: InChI=1S/C14H17N5O2/c1-8-13(9(2)17-14(15)16-8)19-18-11-7-10(20-3)5-6-12(11)21-4/h5-7H,15H2,1-4H3
charge 0 multiplicity 1
38 atoms
O  -1.726246 2.871625 0.240078
O  -4.330349 -2.135215 0.219935
N  0.510429 -0.459724 -0.030937
N  4.070345 0.799599 -0.224804
N  3.969296 -1.65395 -0.302874
N  -0.181828 0.658636 0.052995
N  6.004063 -0.502906 -0.402037
C  1.913318 -0.336448 -0.119415
C  2.711244 0.871223 -0.130634
C  2.615284 -1.593509 -0.209406
C  -1.59016 0.462235 0.138775
C  -2.395724 1.643896 0.237433
C  -2.217577 -0.817064 0.130735
C  -3.615705 -0.924027 0.219697
C  -3.807802 1.515113 0.326633
C  -4.412142 0.24701 0.318125
C  2.141669 2.261744 -0.043651
C  1.880425 -2.912891 -0.205614
C  4.63615 -0.449686 -0.306696
C  -2.541858 4.0856 0.339324
C  -3.545772 -3.367258 0.119616
H  -1.556411 -1.684551 0.052581
H  -4.443464 2.401323 0.403117
H  -5.498875 0.138872 0.385925
H  2.970785 2.986256 -0.076073
H  1.421979 2.450209 -0.859558
H  1.542841 2.390975 0.875162
H  2.612962 -3.731961 -0.270678
H  1.274527 -3.023444 0.710716
H  1.176881 -2.972958 -1.054736
H  6.460512 -1.409215 -0.465783
H  6.532779 0.365591 -0.408637
H  -3.117588 4.110408 1.285056
H  -3.233264 4.180159 -0.520672
H  -1.817764 4.913134 0.324948
H  -2.96994 -3.401302 -0.825956
H  -4.284039 -4.18246 0.135648
H  -2.85168 -3.47284 0.976358
