program: Gaussian 09
title: 000279004
version: EM64L-G09RevD.01
frameworkgroup: C1[X(C19H15NO3S)]
method: RPBEPBE
basis: SDD
operation: Freq
keyword: #p
keyword: freq=noraman
keyword: PBEPBE/SDD
title: #p freq=noraman PBEPBE/SDD
converged: YES YES NO NO
title: Mulliken charges:
elementType: S O O O N C C C C C C C C C C C C C C C C C C C H H H H H H H H H H H H H H H
charge: 0.226200 -0.154920 -0.194769 -0.205925 -0.442625 0.308815 0.269157 0.500195 -0.669254 -0.112237 0.119177 -0.366456 -0.367150 -0.171176 -0.223885 -0.223835 -0.206557 -0.224296 0.446802 -0.379491 -0.372364 0.231971 -0.802971 -0.777423 0.286432 0.288307 0.320971 0.240725 0.240353 0.242006 0.266517 0.235050 0.235035 0.237915 0.228491 0.227095 0.220597 0.264355 0.259168
chargesum: 0.00000
title: Mulliken charges with hydrogens summed into heavy atoms:
elementType: S O O O N C C C C C C C C C C C C C C C C C C C
charge: 0.226200 -0.154920 -0.194769 -0.205925 -0.121653 0.308815 0.269157 0.500195 -0.669254 -0.112237 0.119177 -0.080023 -0.078843 -0.171176 0.016840 0.016518 0.035449 0.042221 0.446802 -0.144441 -0.137329 0.231971 -0.109471 -0.033304
polarizability: 3.15274595e+02 2.38452530e+01 2.80161972e+02 2.06589769e+01 3.43489853e+00 1.72417739e+02
1716.lowfreq: -11.6100 -3.5504 -1.9462 0.0010 0.0012 0.0024 5.3472 13.2661 22.8229
frequency: -11.2365 12.5296 22.0761 27.0893 44.0931 55.5909 67.2163 71.0695 88.8206 118.0983 124.1431 156.6304 175.9445 179.1824 236.5611 255.6475 265.9062 282.1224 310.1968 312.9282 349.2472 357.2537 366.2044 378.1123 405.7429 424.2614 430.7826 448.8082 489.6147 500.8129 534.3629 555.5208 562.4007 599.7830 605.9191 625.0523 630.8662 657.0501 699.2870 706.1111 711.1856 726.5655 785.7895 796.6230 806.4612 818.0218 825.4053 831.6430 842.0753 915.6773 925.4257 951.6947 972.0250 973.7044 986.6514 989.8940 996.8738 1000.1092 1010.9167 1033.0731 1040.2863 1047.8676 1072.2265 1083.0720 1116.5289 1126.1210 1172.3014 1188.0185 1195.5310 1220.4148 1227.6724 1259.3961 1286.3252 1295.5222 1329.1669 1366.0787 1383.3192 1392.0462 1397.7358 1399.0379 1425.0450 1441.2481 1451.5952 1467.1736 1469.7166 1470.2967 1473.5909 1479.6116 1534.0280 1559.6573 1563.6902 1580.6580 1596.6677 1602.7165 1608.5333 1654.7407 2977.3685 2993.2168 3059.2193 3079.3188 3088.2115 3126.5567 3129.9596 3130.3500 3138.2224 3152.8736 3153.2249 3163.8244 3173.3574 3176.9319 3466.2163
redmass: 1.1086 3.2903 5.0937 4.8683 5.4926 1.8348 5.2359 1.8478 4.3426 4.6314 5.2364 6.3242 6.8138 7.6352 5.7908 5.6752 7.8089 4.6998 7.4240 5.2046 6.1131 3.6493 7.7069 7.0512 2.8543 5.3356 3.7864 5.3588 5.0469 3.5016 4.3416 5.5870 2.0114 3.0305 3.6378 4.0988 6.2829 6.0413 4.1132 6.3799 3.4235 3.5348 5.0378 2.2995 3.1890 1.8369 3.4656 4.1506 1.2586 2.5975 2.0329 1.3185 1.6689 2.3536 1.4069 1.4000 2.7893 4.5931 1.3608 1.7852 1.9680 1.5716 2.7284 2.7674 1.3087 2.7816 1.0753 1.1191 2.7624 2.9980 2.3271 3.1163 2.1642 1.2735 6.9020 5.2002 1.2306 3.2225 1.2229 9.8995 1.5861 2.3340 1.1417 1.1364 1.2448 1.8465 1.0557 2.4652 10.4511 8.6331 9.4898 6.3925 8.0820 6.2809 7.0120 6.7528 1.0387 1.0378 1.0949 1.0979 1.0999 1.0884 1.0901 1.0990 1.0863 1.0903 1.0966 1.0948 1.1004 1.0953 1.0762
irintensity: 0.3801 0.4125 0.2104 0.3772 7.7131 3.0821 2.0685 4.0326 1.8644 0.0994 1.9664 0.3033 0.6100 1.2211 2.6639 1.2413 0.4168 0.1901 0.1432 5.9791 3.1484 7.7514 4.4478 5.0660 0.0233 3.4441 1.0817 7.2692 6.9148 23.9567 15.3593 13.5162 38.7939 34.9830 20.8093 32.3356 5.2629 4.7102 20.8884 8.7369 10.4044 19.4919 13.9232 54.0241 7.7474 39.2772 20.3589 4.5756 4.0492 10.2409 4.1195 1.1525 2.8968 15.3403 0.1243 2.9046 69.3891 29.0170 0.4090 31.0596 9.2278 24.7060 2.7784 1.5848 10.8382 85.2735 11.4015 10.2457 83.2663 5.9620 225.9924 279.3586 29.4605 1.0143 386.3136 1.1066 82.8535 7.1126 12.6239 0.5424 198.1485 3.5763 26.8444 27.0823 19.2805 0.1732 12.7427 36.7265 110.3754 317.7654 111.4594 3.4954 14.5586 4.8958 5.1191 126.0698 35.6248 5.6199 19.6364 11.0838 16.1225 10.4388 23.3740 8.7634 3.7934 6.0643 8.7927 1.6222 26.7172 1.3413 24.5464
temp: 298.150 k
press: 1.00000 atm
elementType: 16 8 8 8 7 6 6 6 6 6 6 6 6 6 6 6 6 6 6 6 6 6 6 6 1 1 1 1 1 1 1 1 1 1 1 1 1 1 1
symmnumber: 1
zpe: 759744.4 jmol-1
zpe.correction: 0.289371 hartree
zpe.thermalcorrener: 0.310928 hartree
zpe.thermalcorrenthalpy: 0.311872 hartree
zpe.thermalcorrgfe: 0.235420 hartree
zpe.sumelectzpe: -1409.844284 hartree
zpe.sumelectthermal: -1409.822728 hartree
zpe.sumelectthermalent: -1409.821783 hartree
zpe.sumelectthermalfe: -1409.898235 hartree
dipole: -2.3918 -0.2392 0.6797
dipole: 2.4979
quadrupole: -136.4216 -123.3104 -150.4825
quadrupole: -9.8209 -6.6546 -9.8535
quadrupole: 0.3166 13.4277 -13.7443 -9.8209 -6.6546 -9.8535
hfenergy: -1410.1336554 hartree
pointgroup: C01 [X(C19H15N1O3S1)]
dipole: -0.8378632 -0.4110062 0.308033 debye
polarizability: 289.8832923|32.5343169|303.3810544|17.963636|-12.543206|174.5899581 unknown
InChI: InChI=1S/C19H15NO3S/c1-11-7-9-13(10-8-11)24-19-16(20-12(2)21)17(22)14-5-3-4-6-15(14)18(19)23/h3-10,20H,1-2H3
charge 0 multiplicity 1
39 atoms
S  -1.449081 0.137591 -1.97576
O  2.81855 2.585987 -0.445706
O  0.319469 -2.18696 -1.036004
O  0.650444 3.820653 0.929931
N  0.037623 2.648488 -1.011984
C  2.744058 0.278021 0.26338
C  2.110146 -0.976372 0.046651
C  0.705153 1.446609 -0.748892
C  0.154419 0.214221 -1.070119
C  2.14628 1.527536 -0.284411
C  0.827493 -1.06295 -0.726836
C  3.974216 0.340058 0.960319
C  2.710969 -2.159931 0.534619
C  -2.539605 -0.70189 -0.725154
C  4.561409 -0.842531 1.457119
C  3.92889 -2.092948 1.244383
C  -3.01728 0.01375 0.393979
C  -2.925135 -2.041688 -0.94081
C  -4.305269 -1.966235 1.104141
C  -3.88931 -0.624294 1.304697
C  -3.808559 -2.661302 -0.029547
C  0.105005 3.816302 -0.20016
C  -5.271674 -2.63534 2.065498
C  -0.54746 5.035877 -0.83367
H  4.447664 1.316796 1.101062
H  2.210486 -3.113942 0.341871
H  -0.727965 2.592269 -1.693799
H  5.508003 -0.794718 2.005591
H  4.3891 -3.010091 1.627082
H  -2.70821 1.051287 0.559496
H  -2.516431 -2.59354 -1.79137
H  -4.251206 -0.07029 2.179062
H  -4.104215 -3.704093 -0.195652
H  -6.317949 -2.512573 1.723811
H  -5.078742 -3.719685 2.144182
H  -5.203629 -2.200923 3.078032
H  -1.424423 4.780443 -1.455342
H  0.19052 5.540573 -1.484396
H  -0.848756 5.739239 -0.043295
