program: Gaussian 09
title: 000278975
version: EM64L-G09RevD.01
frameworkgroup: C1[X(C12H10Cl2N2O2S)]
method: RPBEPBE
basis: SDD
operation: Freq
keyword: #p
keyword: freq=noraman
keyword: PBEPBE/SDD
title: #p freq=noraman PBEPBE/SDD
converged: YES YES NO NO
title: Mulliken charges:
elementType: Cl Cl S O O N N C C C C C C C C C C C C H H H H H H H H H H
charge: -0.005155 0.007031 0.874808 -0.541112 -0.525554 -0.485091 -0.664796 0.113406 -0.095556 0.428716 -0.245464 -0.241924 -0.242522 -0.374984 -0.094875 -0.056221 -0.203314 -0.214484 -0.218556 0.285052 0.262305 0.288022 0.288244 0.258685 0.242880 0.241252 0.238667 0.315714 0.364826
chargesum: 0.00000
title: Mulliken charges with hydrogens summed into heavy atoms:
elementType: Cl Cl S O O N N C C C C C C C C C C C C
charge: -0.005155 0.007031 0.874808 -0.541112 -0.525554 -0.200039 0.015744 0.113406 -0.095556 0.428716 0.016841 0.046097 0.045721 -0.116299 -0.094875 -0.056221 0.039566 0.026769 0.020112
polarizability: 4.01657125e+02 1.70971615e+01 2.07898163e+02 -8.44546651e+00 -6.88487019e+00 1.15378292e+02
1716.lowfreq: -11.1323 -5.8367 -2.1683 -0.0026 -0.0016 -0.0010 12.9946 19.8666 32.4319
frequency: 11.6238 19.8068 32.3984 47.3787 58.5530 83.4684 111.5656 133.3490 154.1910 155.8576 185.9928 194.9087 240.9686 248.5605 269.9199 322.9816 334.7861 347.6475 363.0133 380.4954 393.7888 403.0678 416.1702 453.2482 488.9963 499.3502 520.1672 601.8300 607.4331 621.7499 627.0409 651.3649 651.8635 692.3495 730.5461 758.8873 782.6571 798.0412 844.3884 850.8851 862.4603 888.9433 918.6975 926.3020 933.9821 976.7747 982.9854 1003.7048 1007.2847 1034.2145 1044.2792 1075.1288 1106.0725 1126.2503 1172.2453 1176.6591 1229.9424 1291.8769 1299.0347 1301.1350 1382.2874 1403.7730 1410.8833 1433.8722 1450.2851 1476.5087 1541.0106 1575.4943 1583.2257 1600.4959 1618.6978 3134.9866 3143.9962 3153.2338 3157.1451 3160.6756 3162.1669 3172.9707 3343.8850 3501.3282 3673.0248
redmass: 7.6892 7.1822 7.3771 5.9193 9.1109 8.4568 9.7846 6.9914 8.0845 6.2089 27.5733 6.3603 8.6385 6.4129 7.6048 5.0730 4.6500 7.7744 9.6969 6.5521 7.5322 2.8233 6.0118 1.3950 2.6140 4.1389 4.0730 5.8664 1.8126 5.8528 2.5173 6.8907 6.7135 2.3938 2.8231 1.4212 10.8304 4.1236 1.6673 1.2448 1.5788 2.0530 8.0157 2.7705 1.3512 6.1588 1.3873 1.3504 4.2630 1.5634 2.0806 1.5464 1.9538 1.5894 1.0562 1.1244 1.4865 2.7969 2.2179 1.3090 8.6353 6.3608 5.3769 2.2213 2.0232 4.0177 6.2767 5.7299 2.0612 6.8752 2.1233 1.0856 1.0884 1.0927 1.0922 1.0927 1.0966 1.1015 1.0759 1.0476 1.1011
irintensity: 0.4550 0.0198 0.3787 0.5412 1.4904 1.5984 28.8133 6.8933 1.8223 2.8495 0.2345 13.8527 10.9113 1.0077 30.5123 3.5509 8.2807 14.7806 12.4013 22.1202 56.1139 1.2495 19.0350 136.7513 4.5239 70.7061 1.7735 1.1818 37.7143 5.6393 50.7750 12.1719 8.8544 18.3790 6.8639 59.8305 94.9118 8.6442 25.2058 2.2119 20.4046 134.3607 46.9481 17.3247 1.0500 10.3112 0.9616 0.8866 3.4455 8.1929 23.4960 7.8614 56.5540 31.5978 0.0141 18.9626 37.7547 196.8245 20.5743 2.2726 4.1089 55.8564 6.1017 14.4123 20.1650 94.2274 151.2159 10.0235 21.2816 0.7793 223.2550 0.7516 8.4030 2.0390 0.1043 2.1534 4.9579 40.1779 12.1574 51.0614 49.1667
temp: 298.150 k
press: 1.00000 atm
elementType: 17 17 16 8 8 7 7 6 6 6 6 6 6 6 6 6 6 6 6 1 1 1 1 1 1 1 1 1 1
symmnumber: 1
zpe: 517559.6 jmol-1
zpe.correction: 0.197128 hartree
zpe.thermalcorrener: 0.216159 hartree
zpe.thermalcorrenthalpy: 0.217103 hartree
zpe.thermalcorrgfe: 0.146133 hartree
zpe.sumelectzpe: -2039.880828 hartree
zpe.sumelectthermal: -2039.861798 hartree
zpe.sumelectthermalent: -2039.860854 hartree
zpe.sumelectthermalfe: -2039.931824 hartree
dipole: 4.0553 -5.7266 -3.7141
dipole: 7.9393
quadrupole: -121.5511 -123.4394 -138.2123
quadrupole: -10.7352 -4.1277 -6.4224
quadrupole: 6.1832 4.2949 -10.4780 -10.7352 -4.1277 -6.4224
hfenergy: -2040.0779564 hartree
pointgroup: C01 [X(C12H10Cl2N2O2S1)]
dipole: -1.0645317 2.5526148 -1.4517864 debye
polarizability: 395.7506074|-35.7029302|213.5317679|-15.8909654|4.4899102|115.6512038 unknown
InChI: InChI=1S/C6H5Cl2N2.C6H5O2S/c7-3-1-5(9)6(10)2-4(3)8;7-9(8)6-4-2-1-3-5-6/h1-2,9H,10H2;1-5H
charge 0 multiplicity 1
29 atoms
Cl 4.634952 -3.12203 -0.254332
Cl 5.761879 -0.046457 -0.064097
S  -1.25714 -1.014644 0.553818
O  -2.142759 -2.399286 0.550319
O  -0.221988 -0.652692 1.773708
N  -0.055734 -0.96438 -1.342662
N  0.928795 1.558805 -1.145764
C  1.289874 -0.837808 -1.020209
C  -2.493022 0.417387 0.433945
C  1.799352 0.519313 -0.92422
C  2.184274 -1.928101 -0.782601
C  -3.755983 0.151193 -0.119573
C  -2.103541 1.673516 0.928397
C  3.174003 0.726764 -0.624311
C  3.535925 -1.706418 -0.510818
C  4.022863 -0.370916 -0.427114
C  -4.680233 1.22028 -0.189805
C  -3.043203 2.728079 0.85291
C  -4.322475 2.502381 0.290013
H  -0.32024 -1.941713 -1.58331
H  1.800408 -2.953194 -0.815469
H  -4.011846 -0.859163 -0.454539
H  -1.115944 1.807599 1.38304
H  3.579561 1.740347 -0.553378
H  -5.675806 1.04794 -0.61187
H  -2.780063 3.71727 1.242356
H  -5.045178 3.323778 0.236225
H  1.230796 2.528696 -1.116364
H  -0.023828 1.324258 -1.432194
