program: Gaussian 09
title: 000278970
version: EM64L-G09RevD.01
frameworkgroup: C1[X(C15H26O4)]
method: RPBEPBE
basis: SDD
operation: Freq
keyword: #pfreq=noraman
keyword: PBEPBE/SDD
title: #p freq=noraman PBEPBE/SDD
converged: YES YES NO NO
title: Mulliken charges:
elementType: O O O O C C C C C C C C C C C C C C C H H H H H H H H H H H H H H H H H H H H H H H H H H
charge: -0.283755 -0.269117 -0.219998 -0.239285 0.066859 -0.084119 -0.304297 -0.721489 -0.722689 0.208379 0.190758 -0.137499 -0.167733 -0.691267 -0.692987 -0.261757 -0.267143 -0.666236 -0.658425 0.232514 0.285175 0.201483 0.234910 0.234586 0.242353 0.212035 0.221289 0.245085 0.215191 0.203074 0.213997 0.230637 0.225077 0.214840 0.204436 0.236570 0.220296 0.218483 0.233125 0.217486 0.224161 0.254337 0.210031 0.252838 0.237788
chargesum: 0.00000
title: Mulliken charges with hydrogens summed into heavy atoms:
elementType: O O O O C C C C C C C C C C C C C C C
charge: -0.283755 -0.269117 -0.219998 -0.239285 0.066859 0.148395 -0.019122 -0.050510 -0.047012 0.208379 0.190758 0.107586 0.047457 -0.043558 -0.048633 0.195110 0.184464 0.029748 0.042232
polarizability: 2.06181549e+02 4.94637581e-01 1.71948915e+02 -1.62709482e+00 1.57369497e+00 1.55304756e+02
1716.lowfreq: -8.8531 -0.0006 -0.0006 0.0008 6.0528 7.5948 18.0956 33.2417 37.7304
frequency: 16.6709 33.1776 37.7225 46.6992 55.3110 66.3327 73.2148 79.7512 96.0323 105.8389 114.3073 135.5991 157.6387 174.6674 197.2759 206.3303 208.8169 219.1837 226.4350 239.4938 243.1968 259.2182 266.8301 298.6604 308.6319 320.5915 331.2532 374.0866 377.0043 424.1792 426.4683 440.2328 448.3615 471.3727 507.9998 589.9174 656.9954 717.9045 728.8357 737.3389 791.5131 811.8807 819.4971 827.8358 839.2783 849.9349 893.2623 913.9053 922.7121 928.9784 951.7897 953.5705 960.8838 985.6854 996.6140 1006.7042 1018.6704 1066.3499 1094.3484 1096.8442 1106.9151 1109.9280 1118.8383 1143.5086 1154.3624 1156.3971 1168.7771 1176.2931 1182.3000 1193.1126 1264.2506 1275.9592 1278.5788 1293.8500 1302.0765 1302.7446 1329.7998 1341.1839 1353.2674 1355.1443 1371.1298 1382.5339 1389.5164 1390.5312 1392.9689 1401.3562 1454.7157 1457.2266 1460.8887 1462.5587 1465.2158 1466.8476 1467.1406 1468.9376 1477.3968 1480.6883 1483.0278 1484.1626 1486.8181 1489.6215 1619.2462 1625.3125 1666.5242 2969.2831 2971.9530 2979.1591 2983.9287 2989.2977 2992.1674 2996.0768 3010.6697 3028.3996 3028.8165 3061.4709 3067.2222 3070.3318 3073.3664 3076.9255 3080.1148 3081.6272 3084.8429 3086.1059 3092.4482 3093.0305 3095.6832 3105.7834 3118.3539 3118.4057 3121.8834
redmass: 2.6907 3.4960 3.0194 3.2579 3.0887 3.5240 4.1415 2.6085 3.0900 3.7324 3.8222 2.8516 2.7311 2.9004 1.5767 1.1324 1.2722 1.1941 1.4091 3.3271 1.0632 1.5651 2.0825 3.1173 2.8909 3.1042 3.4169 2.5661 3.7055 2.7095 4.2690 3.9531 3.3783 2.8207 3.3636 4.9444 5.3878 4.4137 3.1454 5.2175 2.2081 1.3726 1.7727 3.0629 2.2839 2.2498 2.4447 1.1937 1.2414 2.1730 1.5458 1.4382 1.6881 1.8230 1.5150 2.7150 3.4520 5.2108 2.2707 2.1522 2.4985 2.5652 3.1173 2.0021 1.6822 1.6869 2.5705 2.7641 2.2530 2.3708 1.4245 1.1228 1.1168 1.2801 1.3974 1.3686 1.3263 1.3636 1.3264 1.2827 1.1979 1.2058 1.2066 1.2306 1.2251 1.2058 1.0979 1.0870 1.0527 1.0426 1.0462 1.0511 1.0531 1.0450 1.0481 1.0476 1.0529 1.0511 1.0541 1.0481 10.0968 9.7627 6.7219 1.0350 1.0354 1.0362 1.0843 1.0376 1.0361 1.0366 1.0838 1.0592 1.0591 1.0996 1.0965 1.0990 1.0931 1.1005 1.0966 1.0995 1.0994 1.0978 1.0978 1.1032 1.1036 1.0994 1.0990 1.0971 1.1049
irintensity: 0.0517 0.3985 0.2607 1.0243 2.0390 0.3023 1.3050 0.3023 0.2853 0.0186 1.2920 0.4218 1.7438 0.1449 1.7605 1.0289 1.6484 0.3718 0.3927 0.9377 0.2211 0.3566 0.5964 8.9304 4.3462 8.4532 6.8287 2.4169 3.0152 2.4805 1.4713 4.8315 0.9925 1.0207 9.6049 8.7991 5.9063 0.4628 17.2709 3.1511 4.5640 3.3548 8.4936 5.5308 4.6695 0.6770 3.3362 1.3199 6.2906 29.0444 7.3567 0.2518 12.1294 17.7052 31.3374 46.8840 144.9391 13.8906 98.5905 11.9909 10.4163 107.4903 96.1304 40.2057 16.4849 14.3160 136.0234 91.4024 60.3357 48.5646 11.2286 4.5652 3.6119 1.3093 1.4504 1.5793 15.4472 0.5299 1.2093 1.4205 15.8280 12.3791 9.0317 30.4769 28.1739 23.0718 11.7958 14.3904 11.5713 15.6658 5.9591 1.7288 0.8676 2.1003 12.3625 4.4566 13.2971 17.5136 16.3949 12.1891 170.7701 149.5940 7.4690 30.6113 40.4507 24.3033 12.5215 36.4031 20.1187 19.7135 7.3737 43.2432 17.8037 2.8161 36.7082 18.7803 70.4125 23.6120 44.0130 50.6845 24.6860 38.1550 32.2596 2.7204 4.6049 28.2848 17.5303 28.3765 28.5814
temp: 298.150 k
press: 1.00000 atm
elementType: 8 8 8 8 6 6 6 6 6 6 6 6 6 6 6 6 6 6 6 1 1 1 1 1 1 1 1 1 1 1 1 1 1 1 1 1 1 1 1 1 1 1 1 1 1
symmnumber: 1
zpe: 1004736.6 jmol-1
zpe.correction: 0.382684 hartree
zpe.thermalcorrener: 0.406798 hartree
zpe.thermalcorrenthalpy: 0.407742 hartree
zpe.thermalcorrgfe: 0.327513 hartree
zpe.sumelectzpe: -886.553329 hartree
zpe.sumelectthermal: -886.529215 hartree
zpe.sumelectthermalent: -886.528270 hartree
zpe.sumelectthermalfe: -886.608500 hartree
dipole: -0.2471 2.0393 1.5834
dipole: 2.5936
quadrupole: -102.9796 -111.6985 -119.3940
quadrupole: -3.2250 1.2650 -0.3705
quadrupole: 8.3777 -0.3411 -8.0366 -3.2250 1.2650 -0.3705
hfenergy: -886.9360127 hartree
pointgroup: C01 [X(C15H26O4)]
dipole: 0.0823882 -0.8333635 0.5830448 debye
polarizability: 206.0872257|-1.8093731|172.1396643|-1.7348584|-0.8256875|155.20833 unknown
InChI: InChI=1S/C15H26O4/c1-7-18-13(16)15(12(5)6,10-9-11(3)4)14(17)19-8-2/h9-12H,7-8H2,1-6H3
charge 0 multiplicity 1
45 atoms
O  0.240046 -2.08052 0.321524
O  -2.540766 0.77382 0.286849
O  -1.122595 -1.230593 -1.363928
O  -1.151152 2.407215 -0.603603
C  -0.159035 0.31796 0.327648
C  -0.005308 0.244709 1.908628
C  1.148177 0.832612 -0.311625
C  -1.154731 -0.476361 2.648823
C  0.217302 1.657908 2.497885
C  -0.445538 -1.051387 -0.327139
C  -1.301586 1.284881 -0.068953
C  2.348892 0.206706 -0.237466
C  3.62731 0.728013 -0.86872
C  4.121923 -0.244746 -1.973405
C  4.724313 0.933533 0.209597
C  0.137263 -3.438604 -0.301651
C  -3.740866 1.561674 -0.142362
C  -1.114783 -4.169581 0.190134
C  -4.100591 1.233407 -1.593588
H  0.917273 -0.346721 2.061475
H  1.044411 1.778978 -0.857903
H  -0.89277 -0.56788 3.71987
H  -2.102017 0.082521 2.571422
H  -1.320455 -1.492442 2.252523
H  1.052346 2.181896 2.001247
H  0.450028 1.581798 3.575757
H  -0.689172 2.283573 2.395801
H  2.436403 -0.754612 0.294987
H  3.411097 1.708123 -1.339795
H  4.340725 -1.243134 -1.547818
H  5.049959 0.13467 -2.440846
H  3.360251 -0.369728 -2.763547
H  4.395854 1.651873 0.982105
H  5.65566 1.31687 -0.247581
H  4.963147 -0.023585 0.712128
H  0.126669 -3.318724 -1.399148
H  1.064304 -3.939799 0.020316
H  -4.522619 1.239942 0.564264
H  -3.522277 2.635985 -0.009851
H  -1.130398 -5.19667 -0.219889
H  -1.125918 -4.238579 1.291804
H  -2.027359 -3.650434 -0.146744
H  -5.048837 1.73464 -1.863523
H  -3.313648 1.583757 -2.281307
H  -4.224632 0.145829 -1.728197
