program: Gaussian 09
title: 000279096
version: EM64L-G09RevD.01
frameworkgroup: C1[X(C16H18Cl4N4)]
method: RPBEPBE
basis: SDD
operation: Freq
keyword: #p
keyword: freq=noraman
keyword: PBEPBE/SDD
title: #p freq=noraman PBEPBE/SDD
converged: YES YES NO NO
title: Mulliken charges:
elementType: Cl Cl Cl Cl N N N N C C C C C C C C C C C C C C C C H H H H H H H H H H H H H H H H H H
charge: -0.034586 0.077054 0.095306 0.135489 -0.133664 -0.383349 -0.028440 -0.007177 0.114885 -0.499507 -0.429015 -0.400839 -0.502244 -0.399801 -0.647244 0.196771 0.211785 0.100118 -0.309881 0.146274 -0.325004 -0.258159 -0.089626 -0.760170 0.191350 0.241541 0.219434 0.224696 0.210479 0.227264 0.176115 0.231983 0.196966 0.286540 0.224902 0.231058 0.219739 0.183438 0.300743 0.206567 0.296563 0.261647
chargesum: 0.00000
title: Mulliken charges with hydrogens summed into heavy atoms:
elementType: Cl Cl Cl Cl N N N N C C C C C C C C C C C C C C C C
charge: -0.034586 0.077054 0.095306 0.135489 -0.133664 -0.082606 -0.028440 -0.007177 0.306235 -0.038532 0.006160 0.002539 -0.073294 0.111641 -0.013010 0.196771 0.211785 0.100118 -0.103314 0.146274 -0.028441 0.003488 -0.089626 -0.760170
polarizability: 3.12024351e+02 -2.82986505e+01 2.68615976e+02 -3.23172969e+01 -7.16141092e+00 1.78417482e+02
1716.lowfreq: -5.0969 -2.8301 -0.0015 -0.0014 -0.0012 3.8444 9.4503 15.7614 20.7157
frequency: 8.6936 15.6626 20.6493 25.1995 52.7711 60.8859 64.5047 80.2604 101.0769 113.3284 124.5342 152.4013 163.2130 201.1594 204.7540 211.8872 216.5258 234.1010 251.9028 259.9396 273.0601 291.6121 300.4718 328.8898 331.0210 367.9052 370.5319 411.8734 431.1393 448.2945 468.9893 512.8239 542.6398 547.6434 553.5703 574.9661 579.3193 626.3726 631.4203 652.6828 664.6508 729.6460 747.1275 751.4334 760.6124 785.3051 788.1062 802.3920 825.7371 857.8301 882.7256 896.7229 903.5778 911.6164 926.1612 941.9145 949.7606 983.8313 1020.9638 1028.7819 1045.7254 1061.2380 1065.4799 1102.9147 1112.0899 1122.4272 1127.8400 1149.1779 1161.5075 1180.2182 1200.3609 1207.6355 1215.6953 1221.3826 1235.5260 1248.2084 1260.6205 1280.0329 1292.0819 1299.5060 1311.4504 1337.7964 1339.8684 1347.8450 1353.5912 1366.7540 1372.6610 1404.9979 1417.8509 1429.2798 1457.0767 1467.2697 1469.1629 1470.7281 1474.4504 1476.9206 1483.2641 1491.6545 1505.5661 1551.7047 1566.2768 1606.8895 2807.1389 2835.1499 2849.3776 2965.6504 2988.0459 3004.5915 3020.4854 3023.5831 3035.6289 3037.9122 3068.2584 3076.3863 3090.9258 3096.5834 3125.5925 3175.9752 3187.5956 3566.3872
redmass: 6.5170 8.7576 5.7020 3.2910 4.9112 9.5401 2.1342 5.4907 8.0473 10.2639 2.3022 3.5493 11.1542 3.6954 7.4001 1.3036 6.6203 5.7183 10.7538 5.1490 7.2715 3.2862 2.9883 6.9451 7.3624 5.0561 4.7749 4.8025 2.7146 2.3855 3.2654 2.3334 5.9583 3.3333 1.9828 9.4954 5.8523 3.1060 9.8218 6.8315 5.0933 3.1496 2.8464 4.5999 7.5840 2.2165 5.7633 1.6452 3.5933 1.8145 2.4700 3.6876 1.5172 2.8658 2.7501 1.3601 1.8599 3.6741 2.6804 1.8987 3.3784 1.8836 1.9580 1.3956 2.2585 2.2905 2.4321 1.7354 2.1558 1.8021 2.0406 1.4194 2.7089 1.7275 1.5280 1.3714 1.3132 1.2774 1.2994 2.2340 1.2908 1.5022 1.4361 1.8352 2.5349 1.7204 4.4929 2.4130 4.0364 1.1720 1.1751 1.1217 1.0841 1.8105 1.1487 1.1341 1.0929 1.1040 5.4777 4.1083 4.9685 6.9072 1.0799 1.0648 1.0648 1.0632 1.0694 1.0624 1.0674 1.0710 1.0841 1.0968 1.1018 1.1003 1.1038 1.0942 1.0891 1.0953 1.0937 1.0762
irintensity: 0.3979 0.0857 0.3881 0.4962 0.5498 0.1834 0.0180 0.4408 0.1333 0.6670 0.4726 1.1736 1.3900 0.2724 0.7336 1.1403 0.5276 3.3206 0.0717 0.9930 0.5668 14.2981 0.9442 0.9882 0.4914 0.5916 3.0460 1.5294 0.2175 3.6270 2.6658 41.3856 6.1895 5.3219 76.6105 38.7759 23.7684 2.5688 62.8610 25.7850 51.4631 44.7382 40.7809 78.7738 30.6793 10.7747 76.2926 15.4812 23.3961 2.4933 16.6124 76.3411 22.3140 17.7599 4.1398 0.3731 5.3811 39.3477 12.6286 8.4431 1.2153 15.3540 28.8348 7.6125 10.0138 11.5257 21.2007 5.9099 15.8851 19.0865 12.1192 6.8789 2.0437 19.6221 0.0272 21.9678 16.6224 12.0080 3.3302 21.9779 3.9698 13.4994 0.9007 9.2721 106.8243 9.3752 3.9094 44.2397 92.4852 2.9526 16.2469 6.6210 38.0872 21.2405 20.1431 40.2931 15.5399 1.9276 75.1280 0.9783 584.5740 126.2703 87.0365 38.3754 196.9194 27.9826 61.7087 23.3121 32.0399 53.3245 62.2630 36.6656 1.4337 35.4135 51.0540 4.9462 11.4569 2.4179 1.4605 37.1185
temp: 298.150 k
press: 1.00000 atm
elementType: 17 17 17 17 7 7 7 7 6 6 6 6 6 6 6 6 6 6 6 6 6 6 6 6 1 1 1 1 1 1 1 1 1 1 1 1 1 1 1 1 1 1
symmnumber: 1
zpe: 832694.0 jmol-1
zpe.correction: 0.317156 hartree
zpe.thermalcorrener: 0.341150 hartree
zpe.thermalcorrenthalpy: 0.342094 hartree
zpe.thermalcorrgfe: 0.258509 hartree
zpe.sumelectzpe: -2677.958730 hartree
zpe.sumelectthermal: -2677.934736 hartree
zpe.sumelectthermalent: -2677.933792 hartree
zpe.sumelectthermalfe: -2678.017377 hartree
dipole: -2.1053 -6.0917 1.9439
dipole: 6.7320
quadrupole: -177.9997 -167.4250 -165.2653
quadrupole: 0.7562 2.0017 -6.0345
quadrupole: -7.7697 2.8050 4.9647 0.7562 2.0017 -6.0345
hfenergy: -2678.2758863 hartree
pointgroup: C01 [X(C16H18Cl4N4)]
dipole: -1.6245367 -1.3972366 1.5567614 debye
polarizability: 275.7072501|-47.4941118|289.2213352|-28.2384812|-29.0148343|194.1292235 unknown
InChI: InChI=1S/C16H18Cl4N4/c1-24-8-2-3-11(24)6-7-21-14-12-5-4-10(17)9-13(12)22-15(23-14)16(18,19)20/h4-5,9,11,21H,2-3,6-8H2,1H3
charge 0 multiplicity 1
42 atoms
Cl 3.88911 -4.949036 0.257641
Cl 0.51255 2.515677 -2.611443
Cl 1.895706 3.71989 -0.194041
Cl 3.500879 2.261678 -2.281515
N  -4.93183 0.219476 -0.234755
N  -0.895082 -0.092447 1.695991
N  0.525467 0.997817 0.189049
N  2.496251 -0.051229 -0.781255
C  -3.497004 0.517014 0.048316
C  -3.193493 1.740282 -0.863925
C  -4.265073 1.68962 -2.000415
C  -5.095632 0.417731 -1.699079
C  -3.247354 0.784805 1.545366
C  -1.76943 1.085214 1.881207
C  -5.411496 -1.09022 0.234869
C  0.213411 -0.122097 0.891289
C  1.046512 -1.322033 0.78795
C  2.194169 -1.219018 -0.080102
C  0.804951 -2.548245 1.471744
C  1.644354 0.965925 -0.59848
C  3.065339 -2.338148 -0.24055
C  1.662717 -3.644446 1.310868
C  2.786882 -3.516095 0.449993
C  1.903528 2.267569 -1.367996
H  -2.855283 -0.347119 -0.275076
H  -2.162245 1.702184 -1.251823
H  -3.29239 2.676086 -0.28376
H  -4.907003 2.586109 -1.963507
H  -3.809094 1.644548 -3.004508
H  -6.164806 0.524188 -1.956936
H  -4.689809 -0.454095 -2.275748
H  -3.859572 1.655833 1.848964
H  -3.596035 -0.073554 2.15684
H  -1.36589 1.883341 1.23907
H  -1.690277 1.42417 2.933347
H  -6.473258 -1.215032 -0.042943
H  -5.348742 -1.158281 1.335337
H  -4.838463 -1.949238 -0.202681
H  -1.139458 -0.936294 2.21456
H  -0.05576 -2.667047 2.14046
H  3.927325 -2.233889 -0.903482
H  1.478327 -4.585993 1.835159
