program: Gaussian 09
title: 000278794
version: EM64L-G09RevD.01
frameworkgroup: C1[X(C10H15ClN4O3)]
method: RPBEPBE
basis: SDD
operation: Freq
keyword: #p
keyword: freq=noraman
keyword: PBEPBE/SDD
title: #p freq=noraman PBEPBE/SDD
converged: YES YES NO NO
title: Mulliken charges:
elementType: Cl O O O N N N N C C C C C C C C C C H H H H H H H H H H H H H H H
charge: -0.038134 -0.459383 -0.456833 -0.444339 -0.435673 -0.197120 -0.650328 0.058175 -0.107948 -0.086075 -0.135544 -0.557141 -0.157548 -0.409602 0.276353 0.263061 -0.290769 -0.329255 0.230019 0.269160 0.223606 0.244809 0.233391 0.210227 0.213670 0.247913 0.310689 0.359567 0.392387 0.335754 0.308113 0.323884 0.254915
chargesum: 0.00000
title: Mulliken charges with hydrogens summed into heavy atoms:
elementType: Cl O O O N N N N C C C C C C C C C C
charge: -0.038134 -0.099816 -0.064447 -0.108585 -0.124984 -0.197120 -0.018331 0.058175 0.122071 0.183084 0.088061 -0.078941 0.052679 0.051982 0.276353 0.263061 -0.290769 -0.074340
polarizability: 2.19607350e+02 -1.23294725e+00 1.66220072e+02 1.34368495e+01 4.61282935e+00 9.52302952e+01
1716.lowfreq: -14.1441 -8.0426 -5.0766 -0.0012 -0.0010 0.0021 12.6047 40.9035 50.1999
frequency: 10.5510 40.8661 50.1645 85.0295 104.2497 113.3141 133.9208 181.3021 197.6940 221.2639 239.6238 244.5656 260.5138 291.6619 303.4864 317.5011 331.5053 346.4234 373.8260 398.4555 415.2811 445.3538 472.8971 503.6424 523.0927 544.4085 555.9856 573.4576 580.7005 600.2962 608.8974 672.7547 705.9209 750.7298 801.9172 808.5371 830.2338 845.0163 893.6259 896.5680 919.1743 974.1691 976.8978 1010.7300 1025.2869 1045.7004 1058.7536 1074.3327 1086.5766 1093.6397 1117.9543 1128.2349 1161.2739 1187.4930 1208.2430 1214.8863 1237.9939 1257.7493 1276.6712 1292.6228 1301.9517 1306.1181 1314.1146 1336.1179 1342.6820 1351.1629 1366.1491 1369.0941 1380.2999 1395.6061 1430.7389 1456.9260 1468.6163 1471.2353 1483.3087 1545.9519 1557.1216 1631.5200 2937.7448 2956.5370 2995.4166 2997.6771 3008.6201 3014.8017 3047.2914 3063.5608 3085.5632 3184.6984 3507.6335 3526.9495 3561.0220 3563.8786 3643.3818
redmass: 5.6298 5.4986 7.6388 5.9712 6.0667 2.6878 5.8279 5.1213 5.8584 6.7684 4.4088 4.7607 5.0141 2.9435 2.6292 1.3297 2.0574 1.9579 8.3922 2.4642 1.2623 3.9130 3.2829 4.5658 2.2304 1.9729 2.5925 2.7534 1.9763 5.8263 5.2802 4.6475 5.0032 7.4408 2.9328 5.1154 1.1168 2.5452 1.5154 2.4426 2.0650 4.8054 2.6133 4.0908 2.3462 3.1094 2.5900 2.0135 2.2724 3.8315 2.5573 1.3042 2.2799 1.8534 2.0227 1.4016 1.5115 1.2883 1.3095 1.6982 1.7067 1.4411 1.2765 1.6877 2.5072 1.3070 1.3689 1.3208 1.3671 1.7367 1.7676 2.3627 1.1135 1.9750 1.1023 5.1871 4.6410 1.2781 1.0818 1.0849 1.0652 1.0852 1.0849 1.0602 1.0672 1.0999 1.1066 1.0931 1.0455 1.0765 1.0657 1.0662 1.1021
irintensity: 1.0160 2.0410 2.5794 2.4786 7.0401 3.2719 0.6346 5.8088 5.2896 0.7850 1.9238 2.2717 5.7364 15.1741 6.4398 119.5229 26.2199 66.2650 7.7475 39.9979 166.6070 11.0331 3.7087 6.6406 56.9453 49.0218 61.3869 55.2592 135.4309 15.7044 6.3195 47.3507 6.4583 0.1443 22.4545 28.1234 104.1078 4.5327 5.6261 25.9875 21.3202 67.2111 3.9830 35.4154 84.5675 12.8114 22.7973 167.0240 11.5984 25.4582 23.2442 21.0172 2.4195 60.9609 12.8848 10.6768 12.6542 3.8105 9.6800 10.8031 1.1827 11.9881 7.5974 36.3319 83.8903 11.6116 4.1937 17.8722 5.8639 47.5653 2.1407 168.4503 14.5667 31.2400 22.1240 574.8997 20.0276 149.0906 16.8351 67.9417 19.3501 22.6006 39.9161 33.1891 759.4822 32.8607 48.6263 6.0326 41.7000 39.0636 13.0468 5.5322 35.3071
temp: 298.150 k
press: 1.00000 atm
elementType: 17 8 8 8 7 7 7 7 6 6 6 6 6 6 6 6 6 6 1 1 1 1 1 1 1 1 1 1 1 1 1 1 1
symmnumber: 1
zpe: 677248.5 jmol-1
zpe.correction: 0.257950 hartree
zpe.thermalcorrener: 0.275697 hartree
zpe.thermalcorrenthalpy: 0.276641 hartree
zpe.thermalcorrgfe: 0.210867 hartree
zpe.sumelectzpe: -1293.410810 hartree
zpe.sumelectthermal: -1293.393063 hartree
zpe.sumelectthermalent: -1293.392119 hartree
zpe.sumelectthermalfe: -1293.457894 hartree
dipole: 1.6709 3.8308 2.9159
dipole: 5.0960
quadrupole: -125.9052 -112.4170 -113.6938
quadrupole: -4.9987 3.8535 5.9304
quadrupole: -8.5665 4.9216 3.6449 -4.9987 3.8535 5.9304
hfenergy: -1293.6687604 hartree
pointgroup: C01 [X(C10H15Cl1N4O3)]
dipole: -0.6621144 -1.3573474 1.3186898 debye
polarizability: 219.2835045|-3.549543|164.3058666|-14.449252|-12.3994419|97.4683464 unknown
InChI: InChI=1S/C10H15ClN4O3/c11-9-6(12)10(14-3-13-9)15-5-1-4(2-16)7(17)8(5)18/h3-5,7-8,15-18H,1-2,12H2
charge 0 multiplicity 1
33 atoms
Cl 5.316605 -1.022078 -0.533069
O  -3.932777 1.390389 -1.175172
O  -1.099419 2.3296 -0.323127
O  -3.836581 -2.803095 -0.409886
N  0.212103 -0.641228 0.510919
N  1.429861 1.33812 -0.007027
N  2.591099 -2.179586 0.34853
N  3.786546 1.242729 -0.520188
C  -3.439504 -0.47239 0.386194
C  -1.032409 0.087149 0.828759
C  -3.115494 0.980434 -0.035365
C  -2.186065 -0.894559 1.218549
C  -1.605014 0.97021 -0.324665
C  -3.65958 -1.399218 -0.831364
C  1.402275 -0.017994 0.194647
C  2.611899 -0.809606 0.096477
C  3.751905 -0.084049 -0.303666
C  2.624785 1.914004 -0.334726
H  -4.355178 -0.501615 1.007768
H  -0.808252 0.778811 1.665292
H  -3.276876 1.671107 0.821613
H  -2.384491 -0.840361 2.302699
H  -1.942065 -1.950783 0.993509
H  -1.41281 0.473907 -1.302916
H  -2.770505 -1.4252 -1.483132
H  -4.517305 -1.043221 -1.430801
H  0.129743 -1.63836 0.299478
H  -3.610833 2.281461 -1.466158
H  -0.089774 2.226729 -0.227506
H  -4.704356 -2.887212 0.060227
H  1.945998 -2.548298 1.046843
H  3.457766 -2.697497 0.199927
H  2.638505 2.997098 -0.473561
