program: Gaussian 09
title: 000278961
version: EM64L-G09RevD.01
frameworkgroup: C1[X(C13H22O4)]
method: RPBEPBE
basis: SDD
operation: Freq
keyword: #pfreq=noraman
keyword: PBEPBE/SDD
title: #p freq=noraman PBEPBE/SDD
converged: YES YES NO NO
title: Mulliken charges:
elementType: O O O O C C C C C C C C C C C C C H H H H H H H H H H H H H H H H H H H H H H
charge: -0.274138 -0.265563 -0.224942 -0.233442 0.114745 -0.094176 -0.732710 -0.722505 -0.239200 0.214701 0.185868 -0.131117 -0.261109 -0.267542 -0.756751 -0.666577 -0.668542 0.228031 0.235234 0.200546 0.244400 0.211150 0.220840 0.242628 0.230638 0.226429 0.220781 0.234581 0.221800 0.233401 0.226311 0.222909 0.225503 0.223698 0.257865 0.216154 0.222298 0.261661 0.216143
chargesum: 0.00000
title: Mulliken charges with hydrogens summed into heavy atoms:
elementType: O O O O C C C C C C C C C C C C C
charge: -0.274138 -0.265563 -0.224942 -0.233442 0.114745 0.133855 -0.052530 -0.047888 -0.008562 0.214701 0.185868 0.095312 0.194253 0.187660 -0.082028 0.031139 0.031560
polarizability: 1.74220281e+02 1.27511210e+01 1.52438674e+02 -4.12904123e+00 -1.73302142e+00 1.39554127e+02
1716.lowfreq: -7.2316 0.0004 0.0008 0.0011 2.3855 7.4199 27.7339 33.8441 42.1468
frequency: 27.4064 33.7083 42.1174 54.7243 64.0598 82.9570 97.2986 101.4941 115.4811 128.5494 152.3700 172.3321 180.3448 195.0254 208.0261 221.9566 225.6949 231.5965 265.1225 270.0366 307.6609 314.0566 323.7569 333.0968 362.3320 381.1967 419.9276 440.2613 443.3496 510.0069 599.2690 667.2392 706.1497 717.7657 755.7883 764.2536 794.1124 814.3198 817.8383 835.7416 876.8550 926.1385 929.8057 938.9701 958.8931 968.2901 986.4415 1009.6990 1018.2902 1044.9110 1075.9337 1092.1095 1095.7520 1101.6242 1115.0274 1141.0374 1154.5009 1155.0658 1167.8155 1182.6647 1197.3534 1276.2091 1278.4271 1284.1541 1305.7466 1307.8349 1342.4840 1353.4116 1355.6164 1387.4170 1389.8485 1391.5407 1394.2874 1405.3429 1453.8126 1455.4380 1459.0488 1462.4055 1463.0767 1467.0263 1468.2051 1470.1777 1481.5650 1484.2100 1485.1367 1488.9730 1606.6150 1637.4357 1678.5784 2965.2097 2979.3840 2989.8524 2992.1312 2992.3499 3003.5437 3027.5506 3028.0577 3039.5227 3071.3490 3075.6069 3079.3034 3081.8778 3086.0864 3086.2838 3091.0873 3092.7880 3094.3790 3100.9034 3118.1186 3119.3845 3119.7395
redmass: 3.8701 3.7877 2.6464 2.9595 2.4754 3.3266 3.9138 3.1066 2.2994 2.3663 2.5732 3.3328 2.6803 1.3292 1.2088 1.3876 1.3452 1.0605 3.0473 4.5168 2.6333 2.8238 3.1283 3.2614 4.6824 4.2529 3.3459 2.7394 3.4419 3.3630 5.5237 4.0803 4.0142 3.9983 2.4302 2.6938 2.1385 1.4077 1.5485 3.3941 2.8094 1.5973 1.6042 1.7652 1.4680 1.1149 2.9926 2.7620 3.4835 1.5558 2.9162 2.3691 2.1590 2.3790 2.8825 4.0118 1.7117 1.7372 3.2770 2.1275 3.4291 1.1199 1.1177 1.2770 1.3918 1.2841 1.2775 1.2749 1.3248 1.2048 1.2302 1.2314 1.2333 1.2064 1.0975 1.0963 1.0476 1.0451 1.0423 1.0521 1.0460 1.0607 1.0475 1.0512 1.0514 1.0471 9.6427 10.1172 6.1277 1.0364 1.0359 1.0371 1.0361 1.0361 1.0838 1.0591 1.0596 1.0968 1.0993 1.0981 1.0985 1.0986 1.0979 1.0977 1.0918 1.1032 1.1030 1.0994 1.1057 1.1053 1.0908
irintensity: 1.5749 1.4937 0.3847 0.8115 0.9224 0.8178 0.0452 0.7109 0.1609 0.6073 1.9420 0.5034 0.7811 1.4594 0.6440 2.5234 0.7727 0.1132 0.9672 2.1146 4.4191 3.0764 20.3275 1.0305 5.2449 3.4819 3.4863 0.9411 1.3584 8.2121 8.9900 8.8827 3.0435 1.2966 6.0683 7.0351 3.6846 5.3524 2.3186 3.1428 3.0434 18.4776 22.4615 24.8001 7.0768 50.4997 20.7620 28.3717 258.7300 0.0467 14.5441 171.1484 0.0773 80.7705 61.3707 27.7367 15.4377 21.8811 66.7912 19.4128 172.6911 3.0353 2.4782 2.2396 2.9309 1.6086 5.1627 0.8015 2.0735 9.4583 25.3607 34.7932 10.7025 27.3543 14.5213 9.7021 13.8751 14.4285 14.0234 5.1444 4.0692 17.0029 5.7412 16.0096 11.8572 13.3863 86.7141 177.3622 8.5766 39.0664 25.3339 33.9082 21.9610 17.0226 8.4988 36.2892 24.3420 22.8313 20.2895 18.3279 21.3304 52.9208 43.5025 30.2380 15.7000 3.3920 2.2538 27.9378 27.3620 30.2751 27.8659
temp: 298.150 k
press: 1.00000 atm
elementType: 8 8 8 8 6 6 6 6 6 6 6 6 6 6 6 6 6 1 1 1 1 1 1 1 1 1 1 1 1 1 1 1 1 1 1 1 1 1 1
symmnumber: 1
zpe: 858823.9 jmol-1
zpe.correction: 0.327109 hartree
zpe.thermalcorrener: 0.348401 hartree
zpe.thermalcorrenthalpy: 0.349345 hartree
zpe.thermalcorrgfe: 0.276167 hartree
zpe.sumelectzpe: -808.102008 hartree
zpe.sumelectthermal: -808.080715 hartree
zpe.sumelectthermalent: -808.079771 hartree
zpe.sumelectthermalfe: -808.152949 hartree
dipole: 0.1718 1.5933 1.6579
dipole: 2.3058
quadrupole: -83.5365 -101.8712 -106.0304
quadrupole: -2.3355 -1.9513 -2.0210
quadrupole: 13.6096 -4.7252 -8.8844 -2.3355 -1.9513 -2.0210
hfenergy: -808.4291166 hartree
pointgroup: C01 [X(C13H22O4)]
dipole: -0.0050126 0.5665107 -0.7085205 debye
polarizability: 171.0217108|-15.1592098|155.8402907|-2.8769162|0.835134|139.3510808 unknown
InChI: InChI=1S/C13H22O4/c1-6-9-13(10(4)5,11(14)16-7-2)12(15)17-8-3/h6,9-10H,7-8H2,1-5H3
charge 0 multiplicity 1
39 atoms
O  2.426489 0.121543 -0.369159
O  -2.381273 0.014437 -0.186436
O  1.089291 0.398855 1.517831
O  -1.068228 -1.598816 0.844964
C  0.020944 -0.007887 -0.697141
C  0.359448 -0.994221 -1.893609
C  0.832633 -2.396691 -1.451508
C  -0.835264 -1.104429 -2.871101
C  -0.168143 1.413373 -1.255821
C  1.200515 0.153643 0.297588
C  -1.164914 -0.601932 0.093081
C  -0.782777 2.450849 -0.636153
C  3.638526 0.397458 0.464907
C  -3.579041 -0.555668 0.510872
C  -0.864295 3.849468 -1.200472
C  4.140752 -0.88548 1.132574
C  -3.724332 0.048176 1.910531
H  1.202522 -0.506303 -2.420528
H  1.727599 -2.339416 -0.808918
H  1.093376 -2.991978 -2.346303
H  0.047498 -2.936306 -0.894916
H  -0.525036 -1.646868 -3.782889
H  -1.674583 -1.663999 -2.418025
H  -1.218071 -0.112685 -3.17035
H  0.33955 1.584435 -2.216587
H  -1.270184 2.285034 0.334135
H  4.363052 0.800995 -0.260661
H  3.377981 1.164605 1.215207
H  -4.41479 -0.281058 -0.152318
H  -3.46908 -1.653422 0.558767
H  -1.918023 4.159559 -1.34307
H  -0.348129 3.927638 -2.173732
H  -0.40884 4.583795 -0.50733
H  4.347271 -1.667424 0.381185
H  3.398119 -1.267358 1.852697
H  5.07864 -0.677343 1.680595
H  -3.791207 1.148923 1.861281
H  -2.867199 -0.230829 2.545477
H  -4.647095 -0.332768 2.386431
