program: Gaussian 09
title: 000278785
version: EM64L-G09RevD.01
frameworkgroup: C1[X(C17H14N2O4)]
method: RPBEPBE
basis: SDD
operation: Freq
keyword: #p
keyword: freq=noraman
keyword: PBEPBE/SDD
title: #p freq=noraman PBEPBE/SDD
converged: YES YES NO NO
title: Mulliken charges:
elementType: O O O O N N C C C C C C C C C C C C C C C C C H H H H H H H H H H H H H H
charge: -0.259167 -0.261692 -0.217750 -0.172261 0.013337 0.005527 0.506475 -0.197358 0.360478 -0.576701 -0.277289 0.346963 0.103031 -0.513297 -0.325887 -0.408204 0.450712 -0.437922 -0.367941 -0.220503 -0.221770 -0.238948 -0.535418 0.265164 0.252589 0.293889 0.260416 0.251535 0.244557 0.237842 0.246834 0.227930 0.225714 0.228799 0.251183 0.231122 0.228014
chargesum: 0.00000
title: Mulliken charges with hydrogens summed into heavy atoms:
elementType: O O O O N N C C C C C C C C C C C C C C C C C
charge: -0.259167 -0.261692 -0.217750 -0.172261 0.013337 0.005527 0.506475 -0.197358 0.360478 -0.311537 -0.024701 0.346963 0.103031 -0.219409 -0.065471 0.087888 0.450712 -0.200080 -0.121107 0.007428 0.003943 -0.010149 0.174901
polarizability: 3.70641043e+02 1.11820102e+01 2.21543997e+02 1.00701553e+01 -9.62929135e+00 1.09893443e+02
1716.lowfreq: -9.6724 -3.2043 -0.0003 0.0005 0.0005 3.0460 5.4485 13.8806 41.3417
frequency: -6.5099 13.8652 41.3339 45.1285 52.4906 82.5793 111.9603 122.8942 137.7731 157.5753 176.0255 191.4287 211.9964 228.4307 252.3511 283.4705 331.7237 349.4935 379.7905 384.9261 400.9734 403.0259 449.1489 455.0568 500.0542 509.9577 526.9042 549.2703 585.4571 614.1626 622.3566 623.8271 666.2722 699.2615 702.8811 711.5130 731.0712 748.7365 792.0214 811.9011 826.9680 836.1875 853.0942 886.0469 890.3204 904.8879 905.5142 915.0330 948.1120 976.4598 979.4205 980.4012 987.6999 990.4418 996.9608 1022.5045 1027.7038 1085.7237 1112.0891 1112.5514 1153.6786 1164.9894 1172.5610 1187.5489 1195.5827 1198.7810 1210.2514 1226.1187 1252.4951 1280.4204 1299.5345 1318.3388 1353.2657 1362.5103 1376.2006 1387.0174 1397.3181 1413.3540 1437.2338 1441.1490 1460.0522 1467.7302 1469.4584 1473.1142 1486.9065 1497.3268 1543.2442 1594.8967 1601.2748 1618.7277 1634.0678 2968.2746 3000.8065 3060.2791 3068.4997 3120.7360 3127.6488 3133.8579 3140.9213 3145.8289 3153.0735 3154.7488 3165.8319 3181.7796 3186.3100
redmass: 3.9261 5.3307 6.3662 4.2402 12.9890 3.5919 6.1442 6.3659 4.8991 4.6936 5.5959 2.6476 2.7808 3.1094 2.0787 3.5945 5.2951 8.2186 6.2856 4.8066 2.8171 6.4696 3.7765 5.5510 4.9463 4.5263 4.7836 6.0997 3.2490 6.5790 6.1904 5.8328 4.7332 3.2440 3.0194 7.2104 3.6220 2.0109 4.6556 4.8531 1.4888 5.3254 1.2543 3.5137 2.0597 1.8405 1.7691 3.0359 7.9921 1.4141 1.7320 1.4099 4.6411 5.9780 1.3642 3.2569 2.1602 1.5587 1.2573 1.6526 1.3735 1.4941 1.0546 1.1137 1.1834 2.7696 2.7342 2.0517 2.4158 4.1559 3.5180 1.3972 1.6369 8.2693 3.8915 5.5523 5.9061 5.0654 1.5805 1.6852 1.2900 1.5274 1.0498 1.3514 2.4111 5.5391 7.4565 6.2344 6.5640 6.1052 7.4582 1.0328 1.0602 1.1046 1.1031 1.0860 1.0874 1.1000 1.0922 1.0904 1.0960 1.0922 1.1014 1.0911 1.0972
irintensity: 0.6411 0.4379 1.7619 1.8200 0.6940 1.9291 1.1647 0.5386 12.1350 2.9031 3.9070 1.6543 1.0623 5.6173 1.6433 2.9034 0.6054 0.9953 1.5705 1.3259 1.3416 0.3552 5.0890 2.4150 1.8962 12.3213 3.8314 1.2847 3.8448 8.8047 20.1827 6.3551 3.2284 39.8880 19.5226 8.4769 46.6624 43.6222 18.0517 7.6820 18.6938 9.1217 0.1643 8.0814 19.2939 32.0857 36.4371 19.9053 97.7610 0.8115 6.1738 2.4996 47.4086 0.0559 0.5368 32.6868 10.1681 10.0577 0.1153 104.0767 0.1654 71.6693 0.4660 7.8344 11.2648 123.3541 190.0280 0.3918 175.6299 390.2755 138.1341 1.9575 30.3342 70.0035 37.9137 7.6418 235.2615 9.0730 10.2934 10.1773 35.1215 5.6669 15.6029 65.2033 5.4154 76.4494 178.0611 16.9695 242.9287 1.1093 12.8601 63.4841 6.5982 39.5330 10.0472 5.5944 0.3506 22.3985 24.8081 5.9258 36.9018 4.5245 20.3256 2.2024 4.5879
temp: 298.150 k
press: 1.00000 atm
elementType: 8 8 8 8 7 7 6 6 6 6 6 6 6 6 6 6 6 6 6 6 6 6 6 1 1 1 1 1 1 1 1 1 1 1 1 1 1
symmnumber: 1
zpe: 724823.1 jmol-1
zpe.correction: 0.276071 hartree
zpe.thermalcorrener: 0.294960 hartree
zpe.thermalcorrenthalpy: 0.295904 hartree
zpe.thermalcorrgfe: 0.226931 hartree
zpe.sumelectzpe: -1064.887172 hartree
zpe.sumelectthermal: -1064.868283 hartree
zpe.sumelectthermalent: -1064.867338 hartree
zpe.sumelectthermalfe: -1064.936311 hartree
dipole: 2.3633 -3.7153 -0.0583
dipole: 4.4036
quadrupole: -96.2330 -135.0375 -134.9931
quadrupole: -1.7095 -1.5705 -4.7042
quadrupole: 25.8549 -12.9496 -12.9053 -1.7095 -1.5705 -4.7042
hfenergy: -1065.1632423 hartree
pointgroup: C01 [X(C17H14N2O4)]
dipole: 0.9567629 1.3914433 -0.3874353 debye
polarizability: 370.0629668|-16.6699117|208.1758826|-7.2183292|-38.0223521|123.8396332 unknown
InChI: InChI=1S/C17H14N2O4/c1-22-14-9-13-7-8-16(18-17(13)15(10-14)19(20)21)23-11-12-5-3-2-4-6-12/h2-10H,11H2,1H3
charge 0 multiplicity 1
37 atoms
O  -1.919451 1.033733 -0.147061
O  5.82214 0.583794 -0.202998
O  2.545888 -3.321593 0.166706
O  0.851571 -2.369737 1.361911
N  0.201737 0.038435 0.066045
N  1.896193 -2.290716 0.61687
C  2.227658 1.437517 -0.234014
C  1.575486 0.170806 0.050782
C  2.436819 -0.954912 0.27207
C  3.641391 1.529643 -0.296804
C  1.37255 2.579555 -0.452488
C  4.441593 0.389535 -0.10668
C  -0.540895 1.127274 -0.155303
C  3.832608 -0.86513 0.170843
C  -0.005258 2.441016 -0.406862
C  -2.487688 -0.324999 0.121832
C  -3.994622 -0.214655 0.073723
C  -4.779441 -0.915891 1.021653
C  -4.642705 0.538922 -0.937519
C  -6.191122 -0.876664 0.954892
C  -6.052322 0.587584 -0.998369
C  -6.831692 -0.1238 -0.055336
C  6.693047 -0.585706 -0.027611
H  4.128905 2.48862 -0.50073
H  1.828476 3.554333 -0.65659
H  4.416967 -1.777192 0.313991
H  -0.690944 3.277174 -0.561548
H  -2.118505 -0.678875 1.100183
H  -2.08746 -1.011437 -0.648392
H  -4.287441 -1.494103 1.813354
H  -4.038138 1.096149 -1.660922
H  -6.786955 -1.425121 1.692934
H  -6.543915 1.177313 -1.780413
H  -7.92574 -0.088137 -0.105631
H  7.714317 -0.199576 -0.154835
H  6.486751 -1.357413 -0.793423
H  6.581594 -1.020451 0.984042
