program: Gaussian 09
title: 000278833
version: EM64L-G09RevD.01
frameworkgroup: C1[X(C23H21F3N2O)]
method: RPBEPBE
basis: SDD
operation: Freq
keyword: #p
keyword: freq=noraman
keyword: PBEPBE/SDD
title: #p freq=noraman PBEPBE/SDD
converged: YES YES NO NO
title: Mulliken charges:
elementType: F F F O N N C C C C C C C C C C C C C C C C C C C C C C C H H H H H H H H H H H H H H H H H H H H H
charge: -0.141886 -0.139839 -0.183227 -0.209864 -0.410452 -0.347238 0.036191 0.376187 0.327426 0.343565 -0.363660 -0.398114 -0.346680 -0.381646 -0.389527 -0.415410 -0.359894 -0.399960 -0.267995 -0.256437 -0.255776 -0.253746 -0.229854 -0.248597 -0.245609 -0.247291 -0.247886 0.165939 0.314613 0.271209 0.250470 0.225102 0.264825 0.244693 0.250796 0.261221 0.266433 0.258946 0.247165 0.242064 0.228620 0.226910 0.227017 0.228456 0.224466 0.224326 0.231699 0.229289 0.229830 0.343132
chargesum: 0.00000
title: Mulliken charges with hydrogens summed into heavy atoms:
elementType: F F F O N N C C C C C C C C C C C C C C C C C C C C C C C
charge: -0.141886 -0.139839 -0.183227 -0.209864 -0.139243 -0.004106 0.036191 0.376187 0.327426 0.343565 0.111912 -0.133289 -0.101987 -0.130850 -0.128305 -0.148977 -0.100948 0.089268 -0.039376 -0.029526 -0.028759 -0.025291 -0.005389 -0.024270 -0.013910 -0.018002 -0.018057 0.165939 0.314613
polarizability: 2.56609886e+02 5.22182162e-01 2.68078401e+02 -1.50582284e+01 1.65300689e+00 2.51979042e+02
1716.lowfreq: -6.9825 -4.8774 -0.0008 -0.0006 -0.0004 4.0862 10.9901 12.6558 26.0682
frequency: 10.0103 11.6797 26.0234 28.5593 32.8728 41.6958 56.3865 60.5711 77.0022 80.0766 87.1107 104.0631 138.7098 173.9901 205.1129 216.5174 225.4325 237.8434 259.9728 262.9674 279.7387 292.9636 297.1087 316.0127 352.4558 363.6367 375.4997 401.7259 410.6732 415.2482 436.1521 464.7901 476.3358 480.0026 521.8692 538.4474 608.6457 615.6101 617.9603 618.2058 619.3161 635.7512 639.5753 643.0935 682.4246 701.1147 709.1090 709.3902 714.3413 716.6853 753.8647 754.4868 774.6169 780.2509 833.4133 856.9212 863.2886 867.6810 895.0334 897.8766 933.5237 938.6608 947.0900 983.1585 986.9474 988.8626 990.6230 991.0241 991.7662 993.4642 997.5554 999.2898 1002.9788 1005.6045 1011.9665 1027.9847 1029.6381 1031.2843 1037.9157 1057.3677 1077.5601 1085.7364 1088.2559 1114.9773 1125.1947 1140.9504 1154.8706 1170.6357 1172.2929 1173.9709 1182.2999 1189.7473 1190.6421 1197.6760 1206.8084 1230.4988 1253.0733 1292.8973 1306.3572 1318.7398 1323.3451 1327.6124 1369.8296 1376.0116 1378.5823 1381.3616 1428.2403 1435.8971 1438.1495 1450.5606 1456.1915 1474.7682 1479.5034 1480.5654 1485.4462 1504.8470 1583.0161 1589.6346 1590.9550 1606.7930 1607.2796 1611.4457 1657.2939 2939.7827 3018.2103 3040.2176 3087.2480 3121.2172 3121.4963 3122.6185 3125.6230 3128.2473 3130.4195 3138.8516 3141.9202 3144.5201 3146.5933 3148.9901 3153.3293 3163.0437 3163.5140 3165.1161 3422.9982 3541.3298
redmass: 8.6686 8.5012 8.5850 10.8333 4.2039 4.7030 5.0020 4.8949 4.2117 4.3824 5.2916 4.1147 2.6208 6.7619 4.4885 4.4185 4.5646 5.7376 4.7632 4.6417 5.3925 6.8832 5.4434 4.2623 3.7410 5.5881 12.5794 2.8313 2.9207 2.9492 11.2037 4.4770 5.4599 3.4543 6.4391 3.6018 4.3079 5.8470 6.2966 4.3457 6.2395 2.2077 2.3099 4.5388 2.8343 2.3000 1.8015 9.0095 1.7532 1.7456 1.8636 1.6835 2.0959 2.0647 2.0219 1.2565 1.2475 1.2434 3.7717 3.1557 1.5469 1.5870 1.5664 1.4925 1.5481 5.0468 2.8251 2.3033 4.7105 2.2955 1.7131 1.3127 1.7373 1.7860 6.9412 2.1873 2.3580 2.1168 11.9251 3.9724 1.5772 1.7102 1.6117 3.4098 2.4899 6.3003 3.0904 1.0657 1.0567 1.0551 1.4903 1.5080 1.1383 1.1451 3.4010 1.6796 2.2885 1.1656 1.3444 1.3409 1.2685 1.3194 5.5977 2.5359 2.2524 6.8173 2.0923 2.1416 2.2493 1.2589 1.1343 2.1496 2.1212 2.1296 1.1007 1.7612 5.8190 6.3396 6.2815 6.0392 6.0183 6.0705 9.9066 1.0674 1.0592 1.0932 1.1058 1.0846 1.0845 1.0845 1.0873 1.0874 1.0879 1.0916 1.0921 1.0925 1.0957 1.0953 1.0948 1.1014 1.1013 1.1009 1.0739 1.0779
irintensity: 0.6536 1.1958 0.2932 2.6259 0.5200 0.4740 0.1891 0.3670 0.1661 0.2625 0.4775 0.4377 1.9350 3.7634 2.0725 0.2228 0.8478 1.0179 0.3322 0.9630 0.6152 5.4372 1.2780 4.2300 2.5786 19.7022 4.6731 0.0281 0.0060 0.3695 4.5474 10.0887 14.5576 7.3847 12.7211 3.4382 10.1590 3.8489 1.3241 20.3403 1.5451 43.7906 69.6205 41.0968 37.4072 16.7255 55.5655 3.2851 135.1245 7.4380 3.6892 48.8323 54.6581 24.6400 26.0231 0.6420 0.1643 0.9481 17.4698 13.4423 1.7361 1.7155 2.0487 4.0062 1.7815 36.0049 1.0251 5.0314 38.4396 8.5386 14.5785 0.4912 1.9824 4.3459 110.8900 15.8702 1.1948 12.1164 232.0121 28.7002 2.2335 18.7472 5.4365 27.4628 7.7983 229.5315 8.0888 1.0999 0.5679 0.2223 10.3101 11.1988 7.1235 0.7349 57.5713 11.9659 6.5000 0.3263 1.7090 2.5057 1.1695 0.7465 0.2425 1.5761 1.2076 0.3145 1.7956 11.1290 6.7078 26.9415 25.3050 26.5067 9.4858 30.4323 7.7353 128.2939 0.6937 0.5893 1.0156 10.1487 9.4177 2.5576 250.9416 39.7270 24.8672 9.7025 10.3884 5.4518 2.5160 1.6430 0.0705 2.1267 9.1512 16.1205 25.8857 15.9595 29.8518 19.0921 31.7230 37.4746 21.1655 17.9267 1.9313 45.1170
temp: 298.150 k
press: 1.00000 atm
elementType: 9 9 9 8 7 7 6 6 6 6 6 6 6 6 6 6 6 6 6 6 6 6 6 6 6 6 6 6 6 1 1 1 1 1 1 1 1 1 1 1 1 1 1 1 1 1 1 1 1 1
symmnumber: 1
zpe: 1017366.6 jmol-1
zpe.correction: 0.387494 hartree
zpe.thermalcorrener: 0.413519 hartree
zpe.thermalcorrenthalpy: 0.414463 hartree
zpe.thermalcorrgfe: 0.326328 hartree
zpe.sumelectzpe: -1371.224425 hartree
zpe.sumelectthermal: -1371.198401 hartree
zpe.sumelectthermalent: -1371.197456 hartree
zpe.sumelectthermalfe: -1371.285591 hartree
dipole: 4.1207 -1.8565 1.2264
dipole: 4.6830
quadrupole: -193.2441 -158.7843 -161.0040
quadrupole: 12.7226 -6.5101 4.1147
quadrupole: -22.2333 12.2265 10.0069 12.7226 -6.5101 4.1147
hfenergy: -1371.611919 hartree
pointgroup: C01 [X(C23H21F3N2O1)]
dipole: 1.5634264 0.873687 -0.4323571 debye
polarizability: 260.0043834|-4.3143359|265.6012962|13.4698259|6.6795144|251.0616493 unknown
InChI: InChI=1S/C23H21F3N2O/c24-23(25,26)21(29)27-16-17-28-22(18-10-4-1-5-11-18,19-12-6-2-7-13-19)20-14-8-3-9-15-20/h1-15,27-28H,16-17H2
charge 0 multiplicity 1
50 atoms
F  -6.763757 -0.018688 2.038194
F  -6.290701 -0.879753 -0.003046
F  -5.848437 1.306591 0.433855
O  -4.22778 -1.573808 1.972862
N  0.223076 -0.15409 1.03108
N  -3.470764 0.567019 1.3648
C  1.332021 -0.083709 0.015732
C  1.031647 -1.12325 -1.104077
C  2.670856 -0.384222 0.750164
C  1.470816 1.375503 -0.503432
C  -1.155782 0.065436 0.547199
C  0.262197 -0.785039 -2.247869
C  3.820212 -0.780796 0.018553
C  2.121093 1.662751 -1.730597
C  1.353254 -2.492688 -0.900933
C  2.796251 -0.178216 2.146424
C  1.063507 2.459797 0.313168
C  -2.067446 0.35912 1.762999
C  -0.147294 -1.773711 -3.17085
C  5.056295 -0.98213 0.667093
C  2.336321 2.996788 -2.139862
C  0.944719 -3.483225 -1.818655
C  4.032624 -0.387238 2.799511
C  1.273825 3.794991 -0.094631
C  0.193816 -3.128657 -2.963798
C  5.169048 -0.79078 2.064308
C  1.909307 4.071688 -1.326626
C  -4.409806 -0.423352 1.49471
C  -5.824735 -0.01051 0.994576
H  0.294835 -1.038937 1.55488
H  -1.57243 -0.791786 -0.025609
H  -1.150203 0.938987 -0.129311
H  -0.017398 0.258898 -2.42635
H  3.749478 -0.937656 -1.063446
H  2.466842 0.844142 -2.370897
H  1.934468 -2.786743 -0.019466
H  1.925312 0.161634 2.715177
H  0.599167 2.237676 1.28009
H  -2.050847 -0.491467 2.467073
H  -1.700384 1.255698 2.29331
H  -0.737634 -1.483927 -4.047582
H  5.93127 -1.288407 0.082592
H  2.841467 3.196021 -3.091812
H  1.210895 -4.531183 -1.6400
H  4.107829 -0.22671 3.881141
H  0.952214 4.618714 0.55318
H  -0.123704 -3.896282 -3.678114
H  6.128638 -0.949025 2.569048
H  2.077339 5.106839 -1.644193
H  -3.743235 1.457292 0.941142
