program: Gaussian 09
title: 000278784
version: EM64L-G09RevD.01
frameworkgroup: C1[X(C16H19NO4S2)]
method: RPBEPBE
basis: SDD
operation: Freq
keyword: #p
keyword: freq=noraman
keyword: PBEPBE/SDD
title: #p freq=noraman PBEPBE/SDD
converged: YES YES NO NO
title: Mulliken charges:
elementType: S S O O O O N C C C C C C C C C C C C C C C C H H H H H H H H H H H H H H H H H H H
charge: 0.891760 0.287924 -0.334838 -0.544351 -0.527349 -0.249691 -0.384653 0.217558 -0.374926 0.419927 -0.278641 -0.086573 -0.759992 0.220013 -0.746788 -0.237759 -0.223304 0.453783 -0.333406 -0.395329 -0.800064 -0.254169 -0.668792 0.331541 0.264148 0.203737 0.246254 0.235917 0.249450 0.246998 0.284259 0.279573 0.241021 0.242639 0.228554 0.236042 0.237766 0.238099 0.221876 0.210951 0.270039 0.240795
chargesum: 0.00000
title: Mulliken charges with hydrogens summed into heavy atoms:
elementType: S S O O O O N C C C C C C C C C C C C C C C C
charge: 0.891760 0.287924 -0.334838 -0.544351 -0.527349 -0.249691 -0.053112 0.217558 -0.374926 0.419927 -0.278641 -0.086573 -0.045853 0.220013 -0.014423 0.046499 0.056268 0.453783 -0.092385 -0.152690 -0.097702 0.205806 0.052994
polarizability: 4.03647646e+02 -3.30543295e+01 2.98465316e+02 -8.16331160e+00 1.10346929e+01 1.55391633e+02
1716.lowfreq: -64.4005 -22.2247 -9.5710 -6.7638 -2.8613 -2.3234 0.0007 0.0018 0.0025
frequency: -64.3862 -22.2163 -4.9545 19.4280 31.3047 43.4988 48.8262 54.2627 64.9249 74.7647 95.0512 106.4622 113.2814 118.1066 130.0309 145.1603 164.7484 212.0500 219.7624 247.9803 259.6967 279.1860 281.6409 295.6655 313.1832 332.7349 345.6385 361.1562 374.9605 376.7371 395.5596 407.1768 415.4158 430.4766 471.1326 491.0221 507.7350 543.8196 579.8288 586.2192 621.1922 624.4712 681.1545 698.0611 708.5617 751.0075 771.7533 775.0526 786.3628 824.2496 824.8533 829.7972 846.8324 901.1293 903.4581 962.0460 975.5665 981.5953 986.5491 995.7465 997.9495 1026.7427 1027.8576 1042.2429 1049.7093 1049.8806 1081.1864 1099.5546 1116.7786 1119.7099 1158.1533 1167.4948 1183.3382 1217.3934 1223.0367 1276.2196 1295.4807 1329.6349 1355.5657 1379.5122 1391.2672 1395.2795 1400.5210 1401.4766 1406.2854 1406.8841 1420.2469 1450.5130 1458.4873 1459.2377 1461.6131 1466.0961 1468.5323 1470.2186 1471.7367 1474.8476 1492.2696 1539.6160 1592.5548 1595.4472 1605.9860 2980.6758 2982.0388 2988.4602 3002.1510 3034.1055 3052.7621 3061.0263 3083.4561 3085.7373 3091.7190 3092.9515 3101.9727 3108.3338 3118.7994 3132.5200 3138.0829 3162.3632 3165.6981 3260.2841
redmass: 1.0185 1.0303 6.2877 5.9014 4.2158 4.9458 4.7059 6.2166 3.1558 5.6677 5.1152 3.1498 1.3091 4.0648 4.8030 8.2302 2.8269 6.8764 7.1083 1.3251 4.7407 5.2370 4.1984 4.7239 2.7328 3.5052 3.3146 6.3212 5.5035 5.3308 5.7698 2.8524 6.8438 4.3819 5.2389 6.9449 3.1670 6.3905 5.6672 5.6373 6.9760 8.4631 4.5885 3.8976 3.2798 7.6212 2.3743 5.9465 9.6486 1.7889 1.3763 2.2009 1.2522 2.4519 11.2464 1.3071 1.6398 1.3937 1.7217 2.7828 2.2732 1.4434 2.5440 1.5239 1.6195 2.3712 2.3330 2.1610 1.2949 2.9802 1.6409 3.4462 1.1389 2.9990 2.3782 1.1255 1.2644 1.7987 1.5660 4.6829 3.1051 1.2572 1.2939 1.2457 1.5778 3.9166 3.8296 1.1464 1.0808 1.0891 1.0594 1.2125 1.0389 1.0464 2.3617 1.1110 1.0519 3.3532 6.9066 6.0023 9.3111 1.0383 1.0375 1.0362 1.0367 1.0590 1.0976 1.0975 1.0970 1.0975 1.0989 1.1034 1.0980 1.0978 1.1071 1.0894 1.0893 1.0952 1.0965 1.0730
irintensity: 0.4617 0.4784 1.3498 0.5073 0.0803 1.9843 0.9885 0.3640 1.4027 0.5913 5.8448 2.4193 1.8027 5.2436 16.2966 7.7362 1.5249 21.2751 11.0421 2.9618 16.1744 5.5679 1.1958 0.9925 2.9891 10.9818 7.5023 2.8650 4.8326 8.3563 45.8077 0.2964 73.5833 6.0251 1.0953 9.9167 69.1785 3.7129 6.6723 20.1515 0.1979 9.9904 0.8127 9.3566 0.5081 11.2891 29.3724 23.1002 69.9215 1.3641 34.9181 8.7385 0.7870 17.3954 55.2127 2.1502 67.5292 4.7962 3.6411 22.4601 19.9696 17.4359 171.4218 0.7011 12.6643 33.1511 13.8804 45.1615 4.7261 83.6671 8.6130 27.2618 27.1985 15.8197 37.1823 3.4978 2.3068 58.7094 18.7190 2.5063 8.4663 39.4041 15.0261 38.7629 37.7099 87.1896 57.3530 9.3219 9.0083 31.3239 24.2664 4.2949 20.1058 13.8244 30.5255 15.1277 17.3958 149.6213 0.4534 9.1519 304.1759 28.3141 30.9254 24.2982 24.3195 39.8104 10.9810 16.1108 8.2483 29.4271 18.4269 1.1223 6.7375 37.7670 16.5933 11.7508 14.2379 1.9408 14.3779 110.8807
temp: 298.150 k
press: 1.00000 atm
elementType: 16 16 8 8 8 8 7 6 6 6 6 6 6 6 6 6 6 6 6 6 6 6 6 1 1 1 1 1 1 1 1 1 1 1 1 1 1 1 1 1 1 1
symmnumber: 1
zpe: 831750.1 jmol-1
zpe.correction: 0.316797 hartree
zpe.thermalcorrener: 0.340395 hartree
zpe.thermalcorrenthalpy: 0.341339 hartree
zpe.thermalcorrgfe: 0.261778 hartree
zpe.sumelectzpe: -1771.006322 hartree
zpe.sumelectthermal: -1770.982724 hartree
zpe.sumelectthermalent: -1770.981780 hartree
zpe.sumelectthermalfe: -1771.061341 hartree
dipole: 2.2541 4.1092 -1.9621
dipole: 5.0810
quadrupole: -123.7292 -133.7946 -156.8628
quadrupole: 1.4710 -0.0085 10.0702
quadrupole: 14.3997 4.3343 -18.7339 1.4710 -0.0085 10.0702
hfenergy: -1771.3231193 hartree
pointgroup: C01 [X(C16H19N1O4S2)]
dipole: -0.1058225 -0.1024541 1.9935886 debye
polarizability: 390.6709881|-63.2963035|192.2368751|-9.7746678|52.6088284|274.5967325 unknown
InChI: InChI=1S/C9H12NO2S.C7H7O2S/c1-4-12-9(11)7-5(2)6(3)13-8(7)10;1-6-2-4-7(5-3-6)10(8)9/h10H,4H2,1-3H3;2-5H,1H3
charge 0 multiplicity 1
42 atoms
S  -1.364879 0.131038 -0.7158
S  1.329913 -0.944545 1.986214
O  0.741949 -2.55148 -2.284069
O  -2.315063 -0.318492 -1.979165
O  -0.191866 1.263753 -0.889024
O  3.006435 -2.135708 -2.667564
N  -0.444123 -1.7210 0.058321
C  2.059402 -1.757341 -0.450026
C  0.880834 -1.54456 0.327327
C  3.29264 -1.48802 0.257519
C  3.079882 -1.025579 1.565088
C  -2.494738 0.712202 0.668511
C  4.665827 -1.671954 -0.348282
C  2.02792 -2.150647 -1.879067
C  4.075357 -0.604803 2.609306
C  -1.994891 1.659848 1.578351
C  -3.79345 0.185224 0.738052
C  -4.178113 1.594416 2.727395
C  -2.853851 2.097056 2.608405
C  -4.633172 0.641095 1.779562
C  -5.085391 2.0807 3.842889
C  0.527697 -2.788068 -3.749653
C  0.12916 -1.482862 -4.442686
H  -0.546645 -2.223691 -0.853237
H  4.805355 -0.997955 -1.210656
H  5.464478 -1.481661 0.386385
H  4.789974 -2.69592 -0.741549
H  5.106625 -0.684717 2.230763
H  3.912393 0.444898 2.918241
H  4.000029 -1.229934 3.519036
H  -0.979675 2.052974 1.464474
H  -4.142336 -0.536287 -0.007302
H  -2.491982 2.840564 3.328387
H  -5.654405 0.250698 1.853375
H  -6.071615 1.588093 3.809651
H  -4.640587 1.881252 4.835524
H  -5.250522 3.172235 3.774872
H  1.456761 -3.214432 -4.165517
H  -0.280901 -3.536063 -3.773298
H  -0.11491 -1.690116 -5.501517
H  -0.755134 -1.033378 -3.958538
H  0.957915 -0.75503 -4.418396
