program: Gaussian 09
title: 000278783
version: EM64L-G09RevD.01
frameworkgroup: C1[X(C21H21NO4S2)]
method: RPBEPBE
basis: SDD
operation: Freq
keyword: #p
keyword: freq=noraman
keyword: PBEPBE/SDD
title: #p freq=noraman PBEPBE/SDD
converged: YES YES NO NO
title: Mulliken charges:
elementType: S S O O O O N C C C C C C C C C C C C C C C C C C C C C H H H H H H H H H H H H H H H H H H H H H
charge: 0.912050 0.291481 -0.261494 -0.521694 -0.521812 -0.292552 -0.427374 0.410626 0.162329 -0.349424 -0.319385 0.346765 -0.081986 -0.761496 0.188794 -0.389113 -0.394611 -0.232845 -0.226474 0.452401 -0.373530 -0.358223 -0.230994 -0.227494 -0.245701 -0.799897 -0.256652 -0.672143 0.338780 0.241239 0.262285 0.243744 0.244112 0.239385 0.286422 0.280327 0.242241 0.242694 0.228398 0.228686 0.229783 0.229436 0.231316 0.242158 0.241787 0.225988 0.218922 0.234026 0.248722
chargesum: 0.00000
title: Mulliken charges with hydrogens summed into heavy atoms:
elementType: S S O O O O N C C C C C C C C C C C C C C C C C C C C C
charge: 0.912050 0.291481 -0.261494 -0.521694 -0.521812 -0.292552 -0.088594 0.410626 0.162329 -0.349424 -0.319385 0.346765 -0.081986 -0.014229 0.188794 -0.145001 -0.155225 0.053578 0.053852 0.452401 -0.131289 -0.115529 -0.002596 0.001192 -0.015919 -0.096988 0.211123 0.029527
polarizability: 5.27682894e+02 -1.90602185e+01 2.98004454e+02 7.37186299e+00 -1.47964715e+01 2.02975838e+02
1716.lowfreq: -5.1792 -0.0008 0.0004 0.0011 2.5438 5.2006 5.2848 14.3633 17.5735
frequency: 3.7690 14.2749 17.5307 21.1161 32.6260 39.3746 45.4140 47.1074 56.5092 71.1917 83.1861 93.0623 97.9594 105.7571 120.7350 129.2962 133.1437 146.5562 156.4643 218.3993 221.7287 223.1587 234.6246 266.3688 271.5943 290.9093 293.6109 330.4586 340.0797 359.0605 375.8445 378.8374 386.5186 395.9775 404.2556 407.0424 424.5452 428.4771 469.0699 494.8315 509.8918 526.8303 583.2697 595.7272 613.0815 621.7084 635.6110 656.2086 690.6194 698.7993 709.3224 710.1796 752.8311 756.9992 776.7686 780.2421 797.2699 815.5233 825.3059 836.8911 846.2374 855.8847 892.6838 922.4799 926.2622 961.6224 964.4302 978.2595 981.3563 988.5768 989.2935 993.9653 994.9274 1001.2145 1012.6350 1031.3442 1036.1521 1049.3689 1052.3014 1079.4297 1095.3196 1118.3549 1128.4110 1145.9766 1155.7284 1172.3631 1184.5218 1187.9921 1198.0173 1218.7965 1278.6336 1281.7398 1296.7041 1311.2766 1318.5416 1356.0596 1370.8867 1381.0948 1390.4044 1392.6996 1398.8671 1399.3590 1400.3177 1421.5888 1431.6651 1455.5460 1458.1141 1461.2296 1463.9692 1470.8144 1472.9356 1474.2244 1482.5260 1486.1975 1523.5044 1569.5574 1584.9705 1593.8465 1595.8151 1613.2634 2977.9303 2979.6364 2992.3531 3034.6658 3053.0634 3062.1388 3087.9403 3091.5200 3095.4624 3098.8144 3122.3462 3122.7246 3127.5150 3134.8902 3136.9787 3139.5589 3148.8239 3162.8077 3164.3933 3166.0164 3207.7065
redmass: 5.0516 5.2778 1.0699 4.7727 3.9077 3.5456 4.7544 4.0321 5.0576 4.7655 4.6791 1.7746 4.6093 2.5890 6.6127 5.0938 4.3239 6.4343 3.7437 6.9059 2.1510 3.7299 3.0377 3.4938 4.5113 3.5703 4.1987 4.9940 4.3324 6.4528 3.8484 8.3191 8.0439 6.7561 2.8940 2.8621 3.9949 5.9047 5.5560 5.1236 3.1560 5.3070 5.9232 8.7872 6.9964 6.9628 7.2107 7.8431 4.7283 3.2026 3.2408 1.8740 5.4178 3.3841 5.0359 2.2227 11.5016 1.4139 1.3617 3.3778 1.2605 1.2457 3.6355 9.2494 1.5060 1.3362 1.6828 1.3916 1.3863 5.7555 1.5087 4.4107 1.3580 2.2485 2.8949 1.8744 1.4331 1.5897 2.4609 1.6070 2.1432 1.2973 2.9688 2.7750 1.6851 1.0530 1.1371 1.1150 4.4132 3.0169 1.1554 2.1516 1.2650 1.3854 2.3604 1.4766 6.1425 6.0652 1.2431 2.9955 1.2333 4.9019 1.2165 6.1823 2.3886 1.1341 1.3448 1.0506 1.0460 1.0970 2.3636 1.0629 2.2296 1.0525 4.4616 7.4743 6.0831 6.9188 6.0607 6.2332 1.0380 1.0389 1.0359 1.0596 1.0970 1.0948 1.0973 1.1000 1.1027 1.0977 1.0851 1.1064 1.0877 1.0894 1.0894 1.0924 1.0968 1.0952 1.1017 1.0966 1.0743
irintensity: 0.9842 1.1775 0.6955 0.7056 0.3062 0.1990 0.1459 0.1117 0.5413 1.4041 1.0653 1.2722 5.4927 0.9530 1.8728 13.8858 14.1349 2.9956 0.2938 16.3662 4.0723 13.8740 10.2326 1.4620 4.0717 4.3145 8.8929 5.0415 20.7611 21.9549 5.6553 12.3772 2.6282 107.1038 3.1099 1.3907 2.7364 43.7412 0.3664 9.4208 76.5488 7.6663 29.2975 12.5780 2.1273 0.2940 8.8718 2.4623 10.8463 21.8433 1.3441 40.9933 6.1453 14.9479 8.9308 30.5080 97.5326 3.7543 33.0414 13.9008 1.1091 0.5129 17.7704 85.6850 1.3586 24.8675 131.5084 0.3044 2.0327 1.1141 0.9383 6.2983 1.0135 10.5013 131.3717 6.4044 0.8521 16.7590 39.6995 9.3615 36.2375 11.4097 177.3366 4.7584 43.9533 0.0258 26.6112 1.4572 49.4834 10.6911 2.9304 187.2349 2.1745 6.9544 108.3381 10.5308 6.6288 1.0106 35.1175 8.2878 11.0544 98.1967 10.7259 86.0200 9.1288 26.7957 21.1953 12.3502 14.4463 15.4389 32.9567 13.4824 81.0337 13.2937 47.5128 104.8516 3.3486 0.5291 10.0683 9.3856 23.3415 30.0339 22.4744 25.2682 11.3259 22.0887 36.5864 14.4605 1.9195 5.8978 1.8965 26.9250 0.0803 13.0184 13.5822 19.1761 34.3168 1.8077 30.3796 12.8667 143.0092
temp: 298.150 k
press: 1.00000 atm
elementType: 16 16 8 8 8 8 7 6 6 6 6 6 6 6 6 6 6 6 6 6 6 6 6 6 6 6 6 6 1 1 1 1 1 1 1 1 1 1 1 1 1 1 1 1 1 1 1 1 1
symmnumber: 1
zpe: 968563.0 jmol-1
zpe.correction: 0.368906 hartree
zpe.thermalcorrener: 0.398308 hartree
zpe.thermalcorrenthalpy: 0.399252 hartree
zpe.thermalcorrgfe: 0.301582 hartree
zpe.sumelectzpe: -1962.421399 hartree
zpe.sumelectthermal: -1962.391997 hartree
zpe.sumelectthermalent: -1962.391053 hartree
zpe.sumelectthermalfe: -1962.488723 hartree
dipole: 1.1121 -5.0933 -2.0125
dipole: 5.5882
quadrupole: -127.4243 -174.5352 -182.2561
quadrupole: 17.2360 10.0138 -7.6404
quadrupole: 33.9809 -13.1300 -20.8509 17.2360 10.0138 -7.6404
hfenergy: -1962.7903048 hartree
pointgroup: C01 [X(C21H21N1O4S2)]
dipole: -1.016569 0.3665468 -1.9146748 debye
polarizability: 486.7179113|-84.9204662|256.77699|-70.5132702|-24.6100942|285.168285 unknown
InChI: InChI=1S/C14H14NO2S.C7H7O2S/c1-3-17-14(16)12-11(9(2)18-13(12)15)10-7-5-4-6-8-10;1-6-2-4-7(5-3-6)10(8)9/h4-8,15H,3H2,1-2H3;2-5H,1H3
charge 0 multiplicity 1
49 atoms
S  2.548137 -1.010159 0.760485
S  -0.07729 -0.231764 -1.903659
O  -2.574872 -0.356257 2.439276
O  3.10176 -1.921822 1.997757
O  2.317209 0.603591 0.900897
O  -1.061254 -2.118759 2.255906
N  0.739744 -1.938111 0.09865
C  -2.242642 0.257721 -0.419127
C  -1.429336 -0.653765 0.358764
C  -0.226659 -1.053953 -0.289978
C  -1.652071 0.609718 -1.639551
C  -3.604033 0.742175 -0.038709
C  3.681886 -1.282471 -0.714911
C  -2.16892 1.52174 -2.715705
C  -1.667012 -1.131826 1.737552
C  -3.853069 2.122067 0.172768
C  -4.67968 -0.175189 0.087884
C  3.844658 -0.23241 -1.632497
C  4.33898 -2.518373 -0.828279
C  5.399929 -1.677069 -2.891622
C  4.71675 -0.44398 -2.723307
C  5.204404 -2.702907 -1.927867
C  -5.147813 2.576135 0.510557
C  -5.973831 0.277241 0.422915
C  -6.213154 1.655566 0.636857
C  6.30902 -1.902473 -4.08584
C  -2.851976 -0.763147 3.853964
C  -3.937038 -1.842287 3.904548
H  0.456543 -2.409071 0.993078
H  -2.123324 1.043929 -3.71146
H  -3.217096 1.794162 -2.511293
H  -1.580447 2.457739 -2.771719
H  -3.024041 2.835064 0.096642
H  -4.498286 -1.243097 -0.07996
H  3.325668 0.719494 -1.481531
H  4.197261 -3.296249 -0.071578
H  4.869716 0.361868 -3.450258
H  5.73607 -3.65516 -2.037055
H  -5.321894 3.64465 0.679872
H  -6.795577 -0.442407 0.512102
H  -7.217718 2.006662 0.898162
H  6.709633 -0.951467 -4.47696
H  7.161831 -2.555066 -3.829741
H  5.757666 -2.392748 -4.911527
H  -1.909326 -1.113827 4.308642
H  -3.179169 0.177261 4.32437
H  -4.195083 -2.057883 4.958104
H  -4.85036 -1.502775 3.386142
H  -3.582899 -2.777615 3.439735
