program: Gaussian 09
title: 000278755
version: EM64L-G09RevD.01
frameworkgroup: C1[X(C10H7ClN4OS)]
method: RPBEPBE
basis: SDD
operation: Freq
keyword: #p
keyword: freq=noraman
keyword: PBEPBE/SDD
title: #p freq=noraman PBEPBE/SDD
converged: YES YES NO NO
title: Mulliken charges:
elementType: Cl S O N N N N C C C C C C C C C C H H H H H H H
charge: 0.041263 0.363700 -0.195135 -0.229770 -0.023317 0.080354 -0.027254 0.086041 0.282284 -0.360875 0.397591 0.259054 -0.396043 -0.738209 -0.372929 -0.221317 -0.845678 0.255395 0.279134 0.256926 0.262270 0.266038 0.301797 0.278678
chargesum: 0.00000
title: Mulliken charges with hydrogens summed into heavy atoms:
elementType: Cl S O N N N N C C C C C C C C C C
charge: 0.041263 0.363700 -0.195135 -0.229770 -0.023317 0.080354 -0.027254 0.086041 0.282284 -0.360875 0.397591 0.259054 -0.396043 0.053246 -0.110659 -0.221317 0.000835
polarizability: 2.25594460e+02 -7.39328101e+00 2.23332534e+02 8.38364435e-01 -1.86002436e-01 7.32153527e+01
1716.lowfreq: -6.7936 -0.2037 -0.0025 -0.0024 -0.0022 6.3262 36.5647 49.9423 51.9887
frequency: 36.5435 49.9412 51.9832 104.3968 122.7483 133.3397 143.8465 158.0188 186.5874 189.5203 200.2056 234.6313 262.3542 293.4839 326.9662 335.4276 361.8665 385.1610 402.3767 463.7480 499.2362 516.2778 535.2157 572.0164 581.9710 627.4487 631.9427 687.1083 699.1730 711.8967 778.5938 791.1308 859.9738 910.4579 958.8167 974.2039 993.9197 999.9804 1041.5079 1092.1926 1153.7250 1173.6304 1216.6998 1255.3618 1287.5813 1312.9861 1346.1553 1383.8104 1393.6760 1403.2830 1427.9413 1442.3675 1445.3157 1454.3659 1471.1728 1498.2577 1555.0822 1638.6016 2180.6658 3013.9685 3026.6266 3100.2413 3141.3825 3143.0319 3174.6856 3189.9707
redmass: 3.9631 4.4208 11.5170 5.1558 7.8536 8.4694 1.3583 3.1771 7.2835 2.3355 2.4711 2.8408 5.0310 8.4513 8.1548 8.3338 4.8968 13.4590 10.3362 10.6067 8.3522 9.0603 4.5528 4.4130 4.7277 7.5873 6.5549 10.1754 9.9154 9.5923 7.9122 10.8835 11.3584 1.4352 1.1861 2.6268 2.0922 2.0452 1.7108 5.4984 5.8991 6.2454 6.1840 8.0321 10.8410 3.6045 1.1758 3.1236 1.2567 2.3506 1.0878 1.0707 1.0509 1.1300 5.8758 9.0811 11.9407 9.2676 12.6018 1.0363 1.0294 1.0957 1.1028 1.1031 1.1060 1.0931
irintensity: 7.9937 1.0637 0.2932 1.9133 0.4464 0.3409 0.9157 0.8214 0.9036 2.4704 8.0464 1.7273 2.9147 2.5439 1.2121 6.6835 1.9802 3.0612 2.1878 3.6820 0.8144 2.2488 7.7086 1.6345 49.1908 0.8045 1.9331 1.0028 8.2645 18.7747 17.2542 1.5813 19.9440 12.5639 6.3852 66.0353 35.8453 9.3713 6.9379 7.3300 25.4898 121.7779 263.3211 123.5911 25.0035 12.4787 34.7304 248.8164 55.6594 94.9731 67.8119 15.9243 21.5051 25.1142 48.9543 167.8345 10.9751 134.3651 40.4502 1.1178 10.7392 2.6022 12.3486 3.6576 3.7775 5.1566
temp: 298.150 k
press: 1.00000 atm
elementType: 17 16 8 7 7 7 7 6 6 6 6 6 6 6 6 6 6 1 1 1 1 1 1 1
symmnumber: 1
zpe: 411137.3 jmol-1
zpe.correction: 0.156594 hartree
zpe.thermalcorrener: 0.172724 hartree
zpe.thermalcorrenthalpy: 0.173668 hartree
zpe.thermalcorrgfe: 0.111962 hartree
zpe.sumelectzpe: -1536.398644 hartree
zpe.sumelectthermal: -1536.382514 hartree
zpe.sumelectthermalent: -1536.381570 hartree
zpe.sumelectthermalfe: -1536.443276 hartree
dipole: -2.6282 -2.6926 1.7120
dipole: 4.1338
quadrupole: -127.3051 -109.1079 -110.9553
quadrupole: -9.3027 -4.1082 2.7709
quadrupole: -11.5157 6.6816 4.8341 -9.3027 -4.1082 2.7709
hfenergy: -1536.5552384 hartree
pointgroup: C01 [X(C10H7Cl1N4O1S1)]
dipole: 1.0041367 -0.9733886 -0.8302384 debye
dipolederiv: -0.4395695 0.3139781 0.040934 0.4705818 -0.4905804 -0.0673959 0.0711457 -0.0764944 -0.0533693 -0.3937188 -0.409555 -0.0066147 -0.3052455 0.2461416 -0.0530739 -0.0935086 -0.0794546 0.0249585 -0.9878826 0.2538488 -0.0964738 0.0318057 -0.6559098 -0.0951645 -0.222446 -0.0607515 -0.35406 -1.2452526 0.2897574 -0.0529507 0.6076177 -1.160806 -0.2110485 0.130712 -0.224172 -0.13186 -0.5260397 0.0641808 -0.0183321 0.0709603 -0.410186 -0.0658409 -0.0074516 -0.0485333 -0.1630739 -0.4609886 -0.1208659 -0.0539989 0.1795826 -0.8633509 -0.1454586 0.0212698 -0.1781132 -0.1795832 -0.2338738 0.0138467 0.0127423 0.0672296 -0.4184322 -0.0576929 0.0236987 -0.0599241 -0.2542561 0.9898755 0.1253596 0.103014 -0.4152781 0.0866002 -0.0214044 0.0079567 -0.0312038 0.104492 -0.3139793 0.4878572 0.0964633 0.9457508 -0.0116432 0.0501616 0.2044061 0.006148 0.1152315 1.0542671 0.3293731 0.0222904 -0.0546911 0.6525237 0.1718015 -0.063949 0.1894305 -0.0258241 -0.6863511 -0.0620842 -0.0270615 0.1034741 -0.2885247 -0.0791133 -0.1146399 -0.0566225 0.0199724 1.5997856 -0.6827172 0.1150395 -0.6952095 1.3180072 0.3043022 0.1529534 0.3251053 0.377326 0.9194505 -0.4505871 -0.036074 -0.7491619 1.0841278 0.1871092 -0.1053657 0.2167635 0.0696489 -0.0363647 -0.1489876 -0.0571996 -0.0073623 -0.3927408 -0.1433786 -0.0109189 -0.1706006 -0.0684729 0.4250115 -0.0963009 0.0293735 -0.0564174 0.5341754 0.1271978 0.0162909 0.1311458 -0.0191957 0.0232922 -0.104301 -0.040244 -0.1924911 0.4304701 0.1203617 -0.0460132 0.1013944 0.0792675 -0.0529584 0.0674384 -0.0211503 0.0953757 0.0908603 -0.0101978 0.0368727 0.0064132 0.0199639 0.1106693 0.0124052 -0.066706 0.0182923 0.0675323 0.051959 -0.068037 0.0271229 -0.0083377 0.1085894 -0.0626348 0.0686837 -0.0448132 0.1205356 0.010012 0.068753 0.0115472 0.0600189 -0.0555145 0.1292004 0.0148287 0.0533598 0.0625163 -0.0231367 -0.0133594 -0.0214358 0.117339 0.0611081 -0.038369 -0.0148314 -0.0355199 -0.007465 -0.036187 -0.0173004 -0.0410233 0.125252 -0.0497487 -0.0707328 0.0222441 -0.0635503 0.0481601 0.0118049 0.0277135 0.0179335 0.1373331 0.1209744 0.0980225 0.0663026 0.0082766 -0.0249347 -0.03025 0.0572871 0.0022088 0.0196117 0.0692186 0.0618674 -0.1002791 -0.0325668 -0.017077 0.0046334 -0.05607 0.0131159 -0.0123828 unknown
polarizability: 225.8533767|4.9608224|215.9933544|11.3380243|30.2074585|80.2956153 unknown
InChI: InChI=1S/C10H7ClN4OS/c1-5(16)15-9-7(8(11)13-4-14-9)6(3-12)10(15)17-2/h4H,1-2H3
charge 0 multiplicity 1
24 atoms
Cl -3.429919 1.351331 0.42835
S  2.924159 1.097126 0.853074
O  3.315979 -1.614859 0.69142
N  1.11829 -0.97814 0.280881
N  -0.841637 -2.410185 -0.226132
N  -2.983204 -1.254299 -0.14368
N  -0.551277 3.458031 1.422763
C  -0.266161 -1.227576 0.090984
C  -0.972313 -0.001617 0.323358
C  1.27934 0.40461 0.619395
C  0.005135 1.012167 0.668594
C  2.201916 -1.943335 0.22192
C  -2.376785 -0.100283 0.179664
C  1.925551 -3.27847 -0.423476
C  -2.200788 -2.361091 -0.331127
C  -0.290277 2.346309 1.064254
C  2.640811 2.944179 0.519755
H  1.4988 -3.158485 -1.43361
H  1.178424 -3.852478 0.149254
H  2.877068 -3.828144 -0.470111
H  -2.71475 -3.28894 -0.590636
H  3.662581 3.332332 0.382879
H  2.153542 3.440625 1.367152
H  2.06121 3.082392 -0.403925
