program: Gaussian 09
title: 000278990
version: EM64L-G09RevD.01
frameworkgroup: C1[X(C25H28N2O5)]
method: RPBEPBE
basis: SDD
operation: Freq
keyword: #p
keyword: freq=noraman
keyword: PBEPBE/SDD
title: #p freq=noraman PBEPBE/SDD
converged: YES YES NO NO
title: Mulliken charges:
elementType: O O O O O N N C C C C C C C C C C C C C C C C C C C C C C C C C H H H H H H H H H H H H H H H H H H H H H H H H H H H H
charge: -0.287623 -0.427390 -0.260951 -0.264154 -0.271445 -0.450986 -0.165639 -0.222488 -0.463667 -0.390793 0.177175 0.494530 0.467999 0.219874 0.121739 -0.416158 -0.331831 -0.303813 -0.381362 -0.557295 -0.542368 0.375626 -0.345982 -0.416515 -0.388486 -0.370155 0.326255 0.311769 -0.533510 -0.536786 -0.537861 -0.535792 0.266243 0.256328 0.274051 0.230177 0.226408 0.247762 0.247328 0.277046 0.240200 0.250931 0.269315 0.242953 0.236427 0.254859 0.243854 0.415910 0.254691 0.221271 0.213935 0.216968 0.244689 0.215808 0.220384 0.246499 0.222542 0.213155 0.216929 0.241418
chargesum: 0.00000
title: Mulliken charges with hydrogens summed into heavy atoms:
elementType: O O O O O N N C C C C C C C C C C C C C C C C C C C C C C C C C
charge: -0.287623 -0.011480 -0.260951 -0.264154 -0.271445 -0.450986 -0.165639 0.043754 0.066713 0.065792 0.177175 0.494530 0.467999 0.219874 0.121739 -0.168396 -0.084503 -0.026766 -0.141162 -0.306364 -0.273053 0.375626 -0.103029 -0.180088 -0.133627 -0.126301 0.326255 0.311769 0.156386 0.140679 0.151566 0.135711
polarizability: 3.77473162e+02 -9.99082387e+00 3.72572182e+02 6.00999184e+00 -1.92462078e+01 2.10237222e+02
1716.lowfreq: -9.8209 -4.2603 -0.0005 -0.0003 0.0001 4.4059 20.0836 25.6225 28.2863
frequency: 20.0467 25.5985 28.1747 39.6402 45.8397 54.7677 64.4306 76.9713 88.1719 93.5012 107.3167 120.2132 128.2817 135.9004 149.7799 167.0755 172.5918 183.9635 198.5341 208.5221 219.5284 225.6418 226.2464 243.4778 246.5057 249.0795 268.9640 271.1895 299.0868 310.5929 346.4670 366.9291 369.3260 385.9162 413.4537 418.0046 419.3135 425.1089 436.4901 455.1467 500.2536 503.6054 520.4137 524.9110 546.9067 558.6645 571.3447 587.1592 592.0822 622.2027 628.4512 634.0959 636.9489 701.3117 711.5020 714.1904 717.0138 740.6143 763.8014 777.9491 782.5189 790.2998 809.8183 812.3017 826.9492 841.6507 843.4680 854.5828 880.6899 897.2694 907.6600 913.4643 935.1216 936.0187 937.7765 950.0960 968.4706 975.1665 986.6156 988.2610 1000.1046 1003.9345 1024.0735 1033.8809 1075.4918 1099.3327 1109.9361 1110.9032 1112.7020 1112.8754 1114.0411 1121.2675 1131.3997 1137.9927 1143.5648 1151.9730 1157.6815 1158.9638 1159.4060 1169.2400 1180.1216 1182.6683 1186.5837 1204.6573 1213.8864 1225.7144 1231.5232 1238.4916 1291.3646 1302.7769 1308.7816 1314.7234 1315.7911 1318.7480 1331.5216 1353.6572 1368.9344 1372.2298 1374.9526 1408.2187 1422.1008 1428.8357 1430.2000 1436.6624 1437.0648 1437.7333 1451.1275 1464.2120 1465.7631 1466.7674 1468.8394 1471.3455 1472.3840 1473.3729 1474.6308 1475.6651 1491.9274 1499.0917 1510.6874 1531.1246 1572.0743 1582.3785 1595.8140 1622.8342 1632.1099 1636.6590 2491.2639 2947.5840 2952.9166 2955.3304 2957.0509 2958.9862 3006.4657 3021.3504 3029.9637 3038.0579 3038.5637 3043.8233 3046.7002 3116.6382 3118.1910 3118.6256 3119.9858 3125.8935 3134.4316 3144.8756 3145.1921 3145.6262 3165.4022 3166.8072 3169.3061 3177.1934 3184.9443 3190.5155
redmass: 4.8977 5.1502 4.9082 3.6672 4.4022 3.6348 3.8118 3.4543 3.6596 3.1887 4.5451 4.2851 3.3057 4.4347 4.1551 3.6016 3.5862 2.3174 3.7018 4.1898 1.7961 1.5219 2.6302 1.7177 2.0815 1.6001 2.6461 1.7053 3.9811 3.8318 5.4363 5.3432 5.8948 5.3464 4.6534 3.2131 3.2472 4.8959 4.4495 4.1896 6.1650 3.6334 3.8170 3.0497 2.9056 4.5289 6.4406 4.8493 3.6493 3.8594 5.8972 5.5410 4.9545 4.0106 3.5478 2.8449 3.0270 3.9706 5.3740 2.0726 2.5625 1.6972 1.6120 1.3583 5.2118 1.6535 1.9588 3.0779 2.2001 6.0020 1.5681 2.8086 1.5161 4.6785 1.4269 3.6484 1.4119 2.7479 4.8744 8.2279 2.6948 3.1964 3.2771 3.6609 6.2083 2.6491 1.2595 1.2620 1.2605 1.2666 1.7343 1.3617 2.5557 2.0835 1.1816 1.6084 1.3549 1.3364 1.6346 1.8349 1.2561 1.3093 1.2794 1.5921 1.5464 1.9185 1.9088 2.4752 1.5215 1.7544 1.3360 2.0141 1.3864 1.7128 1.5470 2.7185 5.5990 5.2335 4.5475 2.6752 3.4209 2.3662 1.6477 1.2666 1.2597 1.3218 2.0060 1.0507 1.0512 1.0500 1.0532 1.0947 1.0776 1.0858 1.0785 1.0569 1.1441 2.2404 2.2684 2.2098 7.1406 7.0134 3.4875 6.6749 5.6323 5.6538 1.0685 1.0335 1.0331 1.0337 1.0580 1.0331 1.1029 1.0851 1.1033 1.0646 1.1035 1.1034 1.1040 1.0984 1.1050 1.0996 1.0988 1.0991 1.0894 1.0877 1.0888 1.0876 1.0944 1.0959 1.0961 1.0937 1.0898 1.0924
irintensity: 2.1696 1.0252 0.2657 0.4265 1.7602 1.3438 2.3830 1.5870 9.2512 5.5754 0.9000 4.9434 0.4996 0.9307 1.0452 0.9414 0.4476 1.7147 2.0120 1.6490 1.9440 3.9513 2.3182 0.5818 1.3875 4.5791 6.2070 0.0735 1.5784 8.6597 3.3466 5.9700 2.0068 4.6437 6.1828 0.6540 0.5743 14.5752 4.0929 1.7017 9.2985 16.9940 12.4178 8.2056 14.2798 2.2117 4.4207 41.8619 6.3600 9.6842 0.6118 1.2360 1.9626 65.0262 0.8774 27.8524 9.7110 19.5348 4.8882 14.5167 13.9262 18.1831 71.6215 26.8819 53.6310 33.9745 67.5521 31.8714 8.3891 16.8967 7.6987 35.1747 1.6216 0.2227 2.2004 23.3476 3.2490 2.2613 17.6750 52.8687 35.4238 51.4430 38.3877 15.7813 151.1773 18.4989 0.2341 0.9261 0.1707 0.2897 1.6982 11.2643 204.7280 127.7023 72.2465 32.0747 1.9879 6.1135 22.4009 50.4517 98.6012 47.6572 30.8334 122.6712 19.8996 134.2886 199.1557 103.5696 23.5873 23.7580 1.2914 22.5956 13.0975 8.0486 33.3982 98.7163 6.0107 48.7119 8.1087 109.0273 8.0351 16.4211 28.1884 24.1194 31.7934 2.4467 71.7462 11.9406 5.4169 13.7906 18.4304 101.2932 1.9153 48.1422 82.0808 48.5810 77.0422 243.5787 339.9432 74.0817 2.1618 4.2636 211.3320 51.5939 336.5361 191.4829 1806.1494 84.5384 35.7798 118.7917 39.4269 71.1169 22.6769 16.2909 55.9778 29.1971 50.6676 42.2392 48.1398 35.5862 22.4742 20.6748 24.4163 26.9006 7.3002 16.0172 17.8649 0.4046 8.4003 14.8156 6.0542 8.7241 5.0278 0.7342
temp: 298.150 k
press: 1.00000 atm
elementType: 8 8 8 8 8 7 7 6 6 6 6 6 6 6 6 6 6 6 6 6 6 6 6 6 6 6 6 6 6 6 6 6 1 1 1 1 1 1 1 1 1 1 1 1 1 1 1 1 1 1 1 1 1 1 1 1 1 1 1 1
symmnumber: 1
zpe: 1265736.5 jmol-1
zpe.correction: 0.482094 hartree
zpe.thermalcorrener: 0.512450 hartree
zpe.thermalcorrenthalpy: 0.513394 hartree
zpe.thermalcorrgfe: 0.419766 hartree
zpe.sumelectzpe: -1452.657259 hartree
zpe.sumelectthermal: -1452.626903 hartree
zpe.sumelectthermalent: -1452.625959 hartree
zpe.sumelectthermalfe: -1452.719587 hartree
dipole: -0.9475 1.7489 -0.2818
dipole: 2.0089
quadrupole: -158.3653 -187.5171 -179.5278
quadrupole: 34.0804 -2.0038 -15.5774
quadrupole: 16.7714 -12.3803 -4.3911 34.0804 -2.0038 -15.5774
hfenergy: -1453.139353 hartree
pointgroup: C01 [X(C25H28N2O5)]
dipole: -0.4908362 0.6022188 0.1452989 debye
polarizability: 366.6960485|-8.9708552|373.4716176|9.4646675|43.42057|220.1148994 unknown
InChI: InChI=1S/C25H28N2O5/c1-29-19-9-5-17(6-10-19)26-13-14-27(18-7-11-20(30-2)12-8-18)25(26)24-22(28)15-21(31-3)16-23(24)32-4/h5-12,15-16,25,28H,13-14H2,1-4H3
charge 0 multiplicity 1
60 atoms
O  -2.06788 -1.839434 -0.253768
O  2.693899 -2.72493 -0.232799
O  -0.260524 -6.417461 -0.787913
O  4.179148 4.022868 2.487289
O  -4.578314 3.713507 -0.141787
N  1.927258 -0.329829 -0.425061
N  -0.24814 0.172898 -1.171254
C  0.474017 -0.68131 -0.184744
C  1.984942 -0.184856 -1.929451
C  0.642065 0.492047 -2.310545
C  0.283013 -2.208256 -0.356376
C  2.472184 0.804775 0.320664
C  -1.344156 1.006595 -0.870026
C  -1.023902 -2.765235 -0.411671
C  1.377276 -3.141216 -0.369536
C  3.877058 0.865811 0.465677
C  -2.0002 1.000996 0.39502
C  1.674736 1.826549 0.900657
C  -1.836852 1.916911 -1.857181
C  -1.266586 -4.150331 -0.569781
C  1.158527 -4.529396 -0.517973
C  -0.151811 -5.023882 -0.631702
C  4.493587 1.92247 1.170366
C  -3.069016 1.881029 0.67462
C  2.278707 2.874368 1.618662
C  -2.902385 2.791149 -1.580853
C  3.687845 2.931207 1.75515
C  -3.52272 2.790427 -0.310195
C  -3.446306 -2.290046 -0.429978
C  -1.603331 -6.984192 -0.904638
C  5.630207 4.1213 2.660712
C  -5.222726 3.75119 1.168558
H  0.196671 -0.38638 0.843001
H  2.86256 0.411503 -2.218457
H  2.068189 -1.19368 -2.367695
H  0.25768 0.103012 -3.273254
H  0.762078 1.590726 -2.402811
H  4.494851 0.067702 0.038059
H  -1.716944 0.274437 1.159814
H  0.585813 1.825475 0.789947
H  -1.400438 1.930784 -2.860291
H  -2.287782 -4.531488 -0.618914
H  2.012989 -5.208679 -0.535903
H  5.58287 1.935817 1.269303
H  -3.537219 1.838114 1.663229
H  1.675304 3.666683 2.071608
H  -3.270265 3.482407 -2.345677
H  2.634707 -1.671281 -0.18091
H  -4.054287 -1.378736 -0.326482
H  -3.59956 -2.729911 -1.434394
H  -3.735719 -3.02488 0.347408
H  -2.138108 -6.581651 -1.787613
H  -1.448846 -8.066361 -1.028867
H  -2.203464 -6.798285 0.008159
H  6.147661 4.210244 1.68546
H  5.787665 5.037474 3.248319
H  6.029823 3.249675 3.21491
H  -5.705741 2.783672 1.413659
H  -4.501346 4.012254 1.968757
H  -5.989961 4.536333 1.092795
