program: Gaussian 09
title: 000281517
version: EM64L-G09RevD.01
frameworkgroup: C1[X(C7H9NO2)]
method: RPBEPBE
basis: SDD
operation: Freq
keyword: #pfreq=noraman
keyword: PBEPBE/SDD
title: #p freq=noraman PBEPBE/SDD
converged: NO YES NO NO
title: Mulliken charges:
elementType: O O N C C C C C C C H H H H H H H H H
charge: -0.201254 -0.203014 -0.009778 -0.205265 -0.476687 -0.423914 -0.308299 0.196952 -0.422062 -0.153101 0.257165 0.242588 0.236165 0.233600 0.265911 0.241475 0.225704 0.257069 0.246743
chargesum: 0.00000
title: Mulliken charges with hydrogens summed into heavy atoms:
elementType: O O N C C C C C C C
charge: -0.201254 -0.203014 -0.009778 0.051900 0.002066 0.075597 0.158880 0.196952 0.081751 -0.153101
polarizability: 1.01680542e+02 8.84917127e+00 7.98493500e+01 -2.94586547e+00 -1.10172582e+00 5.90200555e+01
1716.lowfreq: -0.0005 0.0001 0.0009 3.1332 7.9356 16.8803 53.6151 85.3308 87.0158
frequency: 53.5951 85.2694 86.9907 124.4073 186.8610 211.3370 267.1500 358.4339 389.0447 479.0402 499.9480 588.0889 640.2981 661.1812 758.9724 785.7762 853.8168 901.5575 931.2233 947.6032 974.1257 1005.8574 1043.6852 1084.5286 1103.8777 1123.6495 1159.1230 1187.5783 1203.7533 1246.4371 1272.5387 1291.2538 1304.6181 1319.4866 1344.5398 1354.2903 1449.5344 1467.0465 1476.8228 1485.0589 1700.9188 2201.1496 2965.9012 2985.7052 3010.9209 3011.5836 3024.1701 3037.8643 3079.4728 3086.0725 3115.6535
redmass: 4.9497 4.8175 2.7076 3.4588 2.6644 4.7838 6.3378 2.9522 2.9793 6.1490 5.7156 4.3485 3.6508 5.5458 1.2955 3.9023 1.7136 3.5606 3.0749 3.6177 1.6495 2.8743 3.5447 3.0143 2.1438 2.2699 1.2469 1.3188 1.3458 1.2259 1.2396 1.3977 1.1730 1.3470 1.3904 1.5200 1.0817 1.0886 1.0871 1.0884 12.7268 12.4433 1.0817 1.0587 1.0616 1.0619 1.0640 1.1004 1.1035 1.1014 1.1060
irintensity: 5.8237 3.9694 1.3101 2.5191 2.6229 6.4880 5.2755 1.3310 0.3409 3.4123 1.2001 8.6926 6.8960 3.7102 3.6183 4.0419 7.8959 35.8101 24.8069 15.5846 11.5764 28.9264 0.9941 131.9016 66.3799 0.1775 9.8644 22.9040 1.9886 9.5658 1.9444 0.5952 1.5187 2.6577 2.2635 5.1323 4.7696 8.9053 17.0773 1.9993 270.9310 10.1754 8.2048 6.4843 12.2269 22.7870 42.6300 2.8517 18.0139 21.5057 23.7450
temp: 298.150 k
press: 1.00000 atm
elementType: 8 8 7 6 6 6 6 6 6 6 1 1 1 1 1 1 1 1 1
symmnumber: 1
zpe: 394335.9 jmol-1
zpe.correction: 0.150195 hartree
zpe.thermalcorrener: 0.159948 hartree
zpe.thermalcorrenthalpy: 0.160892 hartree
zpe.thermalcorrgfe: 0.114083 hartree
zpe.sumelectzpe: -476.569866 hartree
zpe.sumelectthermal: -476.560113 hartree
zpe.sumelectthermalent: -476.559169 hartree
zpe.sumelectthermalfe: -476.605978 hartree
dipole: -2.1976 -5.7888 1.7920
dipole: 6.4460
quadrupole: -86.9168 -62.5906 -55.7752
quadrupole: 6.6800 3.2472 0.5257
quadrupole: -18.4893 5.8369 12.6523 6.6800 3.2472 0.5257
hfenergy: -476.7200608 hartree
pointgroup: C01 [X(C7H9N1O2)]
dipole: -0.8097918 -2.3145369 0.6471306 debye
dipolederiv: -0.891864 -0.5275013 -0.1120923 -0.2052502 -0.9403874 -0.0450923 -0.1820661 -0.1715169 -0.31639 -0.5530743 0.0087811 -0.0329485 -0.0574285 -1.1375864 -0.053871 -0.0554137 -0.0012135 -0.3279868 -0.3216357 0.0102103 -0.0057503 -0.0471677 -0.2216893 -0.0035053 0.0460844 -0.0051428 -0.227188 -0.2710387 0.1298246 -0.0777877 0.24819 -0.1131329 0.0511934 -0.1097687 0.0448056 0.1693488 -0.1648695 0.0049807 -0.0194131 -0.0774744 -0.0220018 -0.0547544 -0.0340609 0.0046197 0.1146173 0.217959 -0.0505301 0.0180775 -0.0861584 0.0236564 0.0420363 0.0428656 0.0239104 0.113503 0.2809731 -0.0595768 -0.0156146 0.124866 0.6221337 -0.0047973 -0.0469167 -0.0415786 0.3384401 1.1999863 0.4409173 0.2289961 0.061042 1.5711079 0.0718795 0.3406703 0.1201702 0.2628186 -0.0392144 -0.0216199 0.0470551 -0.0086423 0.1789832 0.0479629 0.051956 0.0555952 0.2159698 0.1294396 0.0777142 -0.0740046 0.1419801 -0.0429537 -0.0214393 -0.1294284 -0.0197283 -0.040031 0.072071 -0.0072655 -0.0020218 -0.0102335 0.0490954 0.0043755 0.0097233 -0.0132743 -0.1067842 0.0723739 0.0834431 -0.0286528 0.0724957 -0.0717745 0.0608949 -0.0340628 0.0918656 0.0424335 0.0368668 0.0173752 0.0726648 -0.0103786 0.076415 0.0125944 0.0856148 -0.0349365 -0.0996071 0.0328035 0.0095911 -0.0208345 0.0183805 0.0821394 -0.0153994 -0.0038331 0.0132849 -0.1150541 0.0544012 -0.0156656 -0.0162134 -0.0409847 -0.050164 -0.045781 -0.0147227 -0.0496607 0.0740645 0.0182405 -0.0469487 -0.0563083 -0.0532718 -0.0061752 -0.0464437 -0.097261 -0.0885289 -0.0140819 0.0269339 -0.0017686 0.0605979 -0.0358891 -0.0359244 0.0341289 0.1205976 0.1047703 -0.0849844 0.0570293 -0.0383224 0.0118983 -0.0245099 -0.0619452 -0.0324687 0.0088857 -0.060414 0.0791309 0.0426184 -0.0136387 0.0223522 -0.0095653 0.1002039 -0.0015135 0.0011364 0.0269725 -0.0782188 unknown
polarizability: 101.2442612|9.4322297|80.3312059|-2.6814791|-0.6367165|58.9744807 unknown
InChI: InChI=1S/C7H9NO2/c8-4-1-2-6-3-5-10-7(6)9/h6H,1-3,5H2
charge 0 multiplicity 1
19 atoms
O  -2.845189 0.117304 -0.25532
O  -1.646676 2.073867 0.113768
N  4.357224 0.327145 -0.404652
C  -0.549922 -0.157072 0.445519
C  -1.041228 -1.495343 -0.161579
C  0.813719 0.362718 -0.051437
C  -2.5820 -1.350475 -0.133341
C  -1.683467 0.834215 0.10202
C  1.981036 -0.532497 0.44666
C  3.296578 -0.061436 -0.020009
H  -0.526959 -0.22871 1.554138
H  -0.706875 -2.385189 0.396718
H  -0.685603 -1.584863 -1.204838
H  0.818154 0.400252 -1.156694
H  0.954603 1.398485 0.305777
H  -3.09687 -1.835199 -0.976115
H  -3.022679 -1.689151 0.82136
H  1.842876 -1.575177 0.10088
H  1.990874 -0.558474 1.554148
