program: Gaussian 09
title: 000281550
version: EM64L-G09RevD.01
frameworkgroup: C1[X(C13H9BrN2O)]
method: RPBEPBE
basis: SDD
operation: Freq
keyword: #p
keyword: freq=noraman
keyword: PBEPBE/SDD
title: #p freq=noraman PBEPBE/SDD
converged: YES YES NO NO
title: Mulliken charges:
elementType: Br O N N C C C C C C C C C C C C C H H H H H H H H H
charge: -0.003545 -0.260838 -0.436096 -0.704219 0.335564 0.291809 0.082028 0.111666 0.331781 -0.020726 -0.336359 -0.356077 -0.350577 -0.366431 -0.257943 -0.240394 -0.237315 0.332647 0.241118 0.225951 0.278506 0.247797 0.232361 0.236633 0.305997 0.316665
chargesum: 0.00000
title: Mulliken charges with hydrogens summed into heavy atoms:
elementType: Br O N N C C C C C C C C C C C C C
charge: -0.003545 -0.260838 -0.103449 -0.081557 0.335564 0.291809 0.082028 0.111666 0.331781 -0.020726 -0.095241 -0.130126 -0.072071 -0.118635 -0.257943 -0.008033 -0.000682
polarizability: 2.80281225e+02 8.94829530e+00 2.12485662e+02 5.05129537e-01 -7.37478986e-01 6.49193387e+01
1716.lowfreq: -5.8203 -0.0006 -0.0005 0.0002 3.4951 4.9556 48.6086 81.6490 114.5297
frequency: 48.6058 81.6485 114.5286 134.5925 160.5426 197.1150 218.6788 234.0159 246.6663 281.0162 312.5781 347.6292 376.3397 423.0472 455.6100 470.6358 473.7012 505.4058 529.4568 559.7400 570.9233 587.7525 627.0324 637.1125 656.0283 709.8157 737.7312 749.6898 784.6532 793.3816 799.3197 846.5873 859.2422 871.7869 893.9285 917.8318 979.4039 1007.2549 1035.4519 1046.2728 1077.8850 1112.3360 1119.3015 1158.8959 1182.0190 1254.0821 1256.2649 1275.4103 1306.4973 1334.0940 1380.4198 1393.0096 1420.7841 1430.2007 1435.0622 1486.0166 1490.2915 1564.1299 1588.2280 1606.7027 1617.2559 1628.5127 1653.0219 3133.6924 3148.2721 3159.9148 3160.3607 3171.4620 3186.9873 3506.0087 3518.7875 3651.3460
redmass: 7.8254 4.8412 9.2594 4.9013 6.8225 3.7973 3.2870 15.6824 4.1303 4.8481 1.4137 6.1681 5.3737 3.1997 6.5597 3.9704 5.2024 4.5497 1.3485 5.8248 4.1303 3.8045 5.6125 4.5945 2.6895 4.6844 2.6585 1.9331 1.7396 3.2229 4.1080 1.5093 1.7469 4.8195 1.5236 7.1499 1.3809 1.3437 2.4944 1.7387 3.4411 1.5474 2.9374 1.6445 1.1648 1.8928 1.4178 2.5310 2.9209 2.8127 4.6714 6.0340 3.4665 2.4184 3.3964 3.4714 4.0312 6.3884 5.9706 7.9485 6.1883 4.8787 1.2067 1.0857 1.0894 1.0938 1.0934 1.1004 1.0910 1.0755 1.0468 1.1002
irintensity: 3.6119 2.6892 0.5101 0.2686 2.3391 0.7974 7.2185 3.1438 0.9643 11.4053 26.9609 2.7881 16.0182 2.4689 4.2328 6.6792 8.4303 4.6026 227.4371 12.1372 40.9675 3.8280 10.8993 9.2159 6.3363 25.5458 21.3379 48.4128 92.0732 10.2008 25.4373 29.8923 17.7720 26.9708 0.0149 21.3180 2.2459 0.5988 12.8652 1.8284 0.6969 3.1039 0.4297 34.5841 3.4003 16.1933 6.2734 51.1864 23.6991 114.2033 31.5232 34.3468 31.8197 23.7551 15.3208 40.9144 56.4560 12.7400 182.5688 35.8130 82.2314 282.0056 178.3551 2.6652 10.1007 5.7111 9.0113 25.0458 1.4572 34.6028 46.9860 25.0082
temp: 298.150 k
press: 1.00000 atm
elementType: 35 8 7 7 6 6 6 6 6 6 6 6 6 6 6 6 6 1 1 1 1 1 1 1 1 1
symmnumber: 1
zpe: 500577.4 jmol-1
zpe.correction: 0.190660 hartree
zpe.thermalcorrener: 0.204366 hartree
zpe.thermalcorrenthalpy: 0.205311 hartree
zpe.thermalcorrgfe: 0.149612 hartree
zpe.sumelectzpe: -697.857915 hartree
zpe.sumelectthermal: -697.844208 hartree
zpe.sumelectthermalent: -697.843264 hartree
zpe.sumelectthermalfe: -697.898962 hartree
dipole: 1.7999 0.7451 1.0252
dipole: 2.2013
quadrupole: -119.4710 -84.8199 -112.4749
quadrupole: 20.4804 -1.0910 3.6289
quadrupole: -13.8824 20.7687 -6.8863 20.4804 -1.0910 3.6289
hfenergy: -698.0485747 hartree
pointgroup: C01 [X(C13H9Br1N2O1)]
dipole: -0.7700558 0.0397797 -0.3943025 debye
dipolederiv: -0.4665437 -0.3177152 0.0148451 -0.4205168 -0.4066082 0.0171193 0.0282656 0.0109027 -0.044296 -0.9190247 -0.3867044 -0.028801 -0.5906344 -1.1278255 -0.0572686 -0.0658373 -0.0710541 -0.3745403 -1.1900361 -0.5849352 -0.0690826 0.0388849 -0.4689483 0.03342 -0.0597746 0.0409024 -0.282481 -0.3741094 0.1909563 -0.1896426 0.4404371 -1.2890831 -0.117897 -0.0716715 -0.2266282 -0.5293756 -0.0130264 -0.0214202 -0.0106222 0.0759341 0.1378971 -0.0173842 -0.0360669 -0.0281689 0.0235052 0.4176052 -0.0245322 0.0009078 -0.2743744 0.0771067 0.0070701 -0.0082841 0.0065364 0.0176545 0.1626056 0.7414758 0.0262423 0.3549996 0.2227104 0.0225789 0.0862699 -0.0139839 0.041619 -0.0615587 0.1001467 0.0057853 -0.0491131 -0.4496146 -0.0278269 0.0027175 -0.0220165 0.0086266 0.3016558 -0.4865742 0.0656888 -0.5738749 1.1723401 -0.008665 0.1072376 -0.0626724 0.0710374 1.5744181 0.5126672 0.0575357 0.2904907 1.2988898 0.0776756 0.0552896 0.0941945 0.1871799 -0.3549982 -0.1699406 0.0076792 -0.1334206 -0.2872084 0.0129074 -0.0021755 -0.0013016 -0.1351726 -0.2637078 0.1278498 0.0046681 0.2554055 -0.0113264 0.0050919 0.0154602 0.0019507 -0.1418913 -0.0658806 -0.058506 -0.0081311 0.2196026 0.057622 0.0030158 0.0131046 0.0105073 -0.1063356 -0.2472002 -0.3314893 0.0311913 -0.0487639 -0.4113334 0.0092621 -0.0349698 0.096848 -0.1591862 0.7519584 0.6168688 -0.0380363 0.6793827 0.7324415 -0.045217 -0.060564 -0.0316363 -0.1130209 0.1190581 -0.0271072 -0.0021792 -0.0429802 0.1730694 0.0130499 -0.0073517 0.0122869 -0.1344011 0.0663864 -0.0092407 -0.0051445 -0.1381969 -0.1627814 -0.0024641 -0.0102626 -0.0014818 -0.1641664 0.1679954 0.0243788 0.0071435 -0.0276951 0.1853873 -0.0123837 0.0083495 -0.0273523 0.298858 0.1148724 0.0659785 -0.001349 0.0338756 -0.0194595 0.0022971 0.0212228 0.0119206 0.1554464 0.030344 -0.1191104 -0.0027306 -0.0855548 -0.0110199 -0.0054227 -0.002402 -0.0037455 0.1450944 0.0721438 -0.0279769 0.0007078 -0.1025663 0.0464046 -0.0009756 -0.0037125 -0.0033061 0.154538 -0.0532828 0.0504953 -0.0144722 0.0598404 0.0736129 0.0018822 -0.0207188 -0.0030306 0.1682768 0.0518898 0.0639738 0.0041619 0.0969801 -0.0901224 -0.0105351 0.0055586 -0.009836 0.1545642 -0.1236722 0.040405 0.0066421 0.0358984 0.0828276 -0.0039867 0.0064454 -0.0041856 0.1606297 0.1674385 0.0619277 0.0928832 -0.0351982 0.2577324 0.0479959 0.0394082 0.1675423 0.2602036 0.1346692 -0.0318712 0.0441089 -0.0588419 0.2172892 0.0566604 -0.0055382 0.0568079 0.3376333 unknown
polarizability: 278.3343428|14.3861077|214.4088975|-2.2907646|0.6308787|64.9429861 unknown
InChI: InChI=1S/C13H9BrN2O/c14-7-5-10-8-3-1-2-4-9(8)13(17)16-12(10)11(15)6-7/h1-6,16H,15H2
charge 0 multiplicity 1
26 atoms
Br -4.140519 -2.598255 0.141572
O  2.180376 2.805213 0.210853
N  0.030206 1.937617 0.105925
N  -2.692135 2.57483 -0.071834
C  -0.465089 -0.459743 0.02664
C  0.986481 -0.719558 0.006197
C  -0.906322 0.894421 0.037077
C  1.901924 0.383084 0.02891
C  -2.300058 1.220829 -0.018733
C  1.426021 1.787443 0.116554
C  -1.441229 -1.49742 0.052285
C  1.531669 -2.034881 -0.04869
C  3.302938 0.163678 -0.001081
C  -3.249163 0.175147 0.018012
C  -2.799707 -1.161939 0.074193
C  2.921003 -2.243184 -0.080434
C  3.816996 -1.141653 -0.057168
H  -0.307369 2.888625 0.28577
H  -1.140439 -2.546313 0.066879
H  0.867421 -2.903969 -0.072077
H  3.955388 1.042526 0.02538
H  -4.318608 0.402672 -0.02253
H  3.313696 -3.265005 -0.124431
H  4.898481 -1.310768 -0.081917
H  -2.196227 3.214378 -0.693436
H  -3.676437 2.791324 0.075381
