program: Gaussian 09
title: 000281505
version: EM64L-G09RevD.01
frameworkgroup: C1[X(C7H11NO)]
method: RPBEPBE
basis: SDD
operation: Freq
keyword: #p
keyword: freq=noraman
keyword: PBEPBE/SDD
title: #p freq=noraman PBEPBE/SDD
converged: NO YES NO YES
title: Mulliken charges:
elementType: O N C C C C C C C H H H H H H H H H H H
charge: -0.230224 -0.427760 0.211278 -0.599576 0.069003 -0.728424 -0.728425 0.532083 -0.741022 0.249507 0.249493 0.244952 0.221480 0.213999 0.213991 0.221468 0.244931 0.323610 0.224190 0.235445
chargesum: 0.00000
title: Mulliken charges with hydrogens summed into heavy atoms:
elementType: O N C C C C C C C
charge: -0.230224 -0.104150 0.211278 -0.100576 0.069003 -0.047993 -0.048036 0.532083 -0.281386
polarizability: 1.16688856e+02 7.36540852e+00 8.00032401e+01 3.65318214e-03 -1.26377415e-03 5.92923466e+01
1716.lowfreq: -36.2141 -12.5948 -11.3658 0.0004 0.0005 0.0010 17.7997 143.0016 213.7538
frequency: -34.1974 142.9921 213.7534 226.2332 250.0060 284.0879 298.2241 339.7951 360.9895 479.7219 522.0834 567.4871 620.2826 635.6102 706.6504 713.0530 742.6207 859.2736 874.0579 879.6025 909.2046 952.5506 970.4869 980.3939 1016.9565 1109.8574 1157.7376 1219.6645 1235.2571 1239.1924 1292.1836 1321.3723 1326.3843 1378.7128 1397.6652 1441.6656 1462.1465 1462.4639 1470.6083 1479.7453 1489.3756 1661.5347 1687.9840 2977.8696 2980.0008 3012.9982 3065.5620 3072.5822 3076.4882 3088.7758 3092.9651 3111.4775 3219.9659 3554.5491
redmass: 2.6712 5.3066 2.6480 1.0966 1.2499 2.8574 2.0056 2.7004 2.0121 2.4159 3.0416 3.8241 7.9278 1.1218 1.8947 4.2194 2.1306 1.3339 3.1997 2.1540 1.8565 1.3609 1.7121 1.7347 1.3470 1.5264 2.3126 2.0836 1.9879 3.0313 3.0737 1.5548 3.0967 1.1863 1.2098 1.2156 1.0855 1.0466 1.0496 1.0558 1.0596 7.4403 7.3818 1.0348 1.0355 1.0609 1.1033 1.1007 1.0998 1.1003 1.0995 1.0628 1.1143 1.0784
irintensity: 0.1989 2.8369 0.1942 0.0664 1.6580 5.8161 0.2543 3.7076 0.4718 10.2238 11.8865 0.6915 5.6737 61.6282 1.3204 9.7180 42.4304 117.2949 2.6126 4.0055 12.3689 0.7252 5.1052 1.2831 0.2416 2.0699 47.7244 14.6232 2.9617 116.2051 47.7157 6.7454 38.7705 16.9340 26.1726 1.9508 10.5938 2.5884 5.7459 14.5111 12.1363 521.6345 48.3113 31.5743 19.9265 14.7699 4.9774 21.7036 45.0454 5.3463 33.0720 1.7209 10.8442 24.2942
temp: 298.150 k
press: 1.00000 atm
elementType: 8 7 6 6 6 6 6 6 6 1 1 1 1 1 1 1 1 1 1 1
symmnumber: 1
zpe: 440422.6 jmol-1
zpe.correction: 0.167748 hartree
zpe.thermalcorrener: 0.176166 hartree
zpe.thermalcorrenthalpy: 0.177110 hartree
zpe.thermalcorrgfe: 0.135379 hartree
zpe.sumelectzpe: -402.631671 hartree
zpe.sumelectthermal: -402.623254 hartree
zpe.sumelectthermalent: -402.622309 hartree
zpe.sumelectthermalfe: -402.664041 hartree
dipole: -1.7759 -2.4475 0.0007
dipole: 3.0240
quadrupole: -55.2666 -56.3303 -55.6814
quadrupole: -7.7646 0.0030 0.0012
quadrupole: 0.4929 -0.5709 0.0781 -7.7646 0.0030 0.0012
hfenergy: -402.7994196 hartree
pointgroup: C01 [X(C7H11N1O1)]
dipole: 0.7516523 -0.913256 -0.1281464 debye
dipolederiv: -1.0163145 0.2646014 0.0801202 0.5142469 -0.8964283 -0.0825586 0.0946019 -0.057795 -0.3725048 -1.4467192 0.3213111 0.1309048 0.2497845 -0.5057753 -0.0365062 0.1270686 -0.0436836 -0.3173194 0.0524234 -0.0619482 0.0025397 -0.0769187 -0.236117 -0.0136315 0.0015701 -0.0152119 0.1155838 -0.0695609 -0.0635474 0.0133723 -0.0811074 -0.0552814 -0.0017065 0.0120662 -0.0034818 0.1045056 1.8711205 -0.3499082 -0.1928153 -0.0701612 1.0015956 0.0601359 -0.1757247 0.0873096 0.136654 0.020481 0.0428023 -0.0179452 -0.0178873 0.0515555 -0.0106531 0.0028101 0.0294525 0.0065388 0.0230885 0.0345892 0.0191183 -0.0141875 0.0534474 0.0196123 -0.0081069 -0.031165 0.0021787 0.9342469 -0.2130794 -0.0992447 -0.5169818 0.6105543 0.0842499 -0.1175098 0.0546692 0.0602017 -0.6267737 0.1111844 0.0145105 0.0436963 -0.0255953 0.0270497 0.0106114 0.0204817 -0.5472246 0.0343028 -0.0181662 0.0183133 -0.0170324 0.0181107 -0.0729434 0.0212765 -0.1086077 -0.0494179 0.0236312 0.0069381 -0.0313337 0.0014796 -0.0045847 0.0793009 -0.0344802 0.1145763 -0.016107 -0.0771785 0.063175 -0.0131104 0.1175678 0.0556046 -0.005594 0.031212 -0.0283575 0.0892724 0.0367385 -0.0320908 0.1084675 -0.0264483 0.0749566 0.0539632 0.0606391 0.0391113 -0.1160626 0.0607245 -0.0468011 -0.0251033 -0.0884419 -0.1503442 -0.0285192 -0.0260681 0.0075533 0.0703819 0.0691982 -0.0526993 0.0194458 -0.0864277 -0.1513094 0.0194257 0.01581 -0.0240727 0.0628187 -0.0018665 -0.0221671 -0.1352696 -0.0252399 0.0828361 -0.0269314 -0.0872508 -0.0118801 -0.0853563 -0.0721864 0.0631439 0.0530051 0.1169958 0.0541158 -0.0216622 0.0151614 0.011737 0.0857608 0.1006095 -0.0195529 0.0229143 0.0030248 0.1442241 -0.0123986 0.0242072 -0.0101866 0.3437359 0.0227073 -0.0654834 0.015908 -0.0966678 -0.0648136 -0.0080818 0.0139359 -0.0111126 0.2245924 0.0613274 0.0376987 0.0162025 0.0707063 -0.0567515 -0.0225511 0.0181701 -0.0193363 0.2017677 unknown
polarizability: 116.892757|-4.7473212|79.1248829|-5.9033249|1.6484323|59.9668029 unknown
InChI: InChI=1S/C7H11NO/c1-5-4-7(2,3)6(9)8-5/h8H,1,4H2,2-3H3
charge 0 multiplicity 1
20 atoms
O  -1.371793 1.858386 0.292222
N  0.854346 1.120223 0.030303
C  -0.809088 -0.587397 0.090985
C  0.607413 -1.22885 -0.086211
C  -0.526435 0.936426 0.154794
C  -1.745197 -0.866741 -1.113417
C  -1.498294 -1.018587 1.411496
C  1.607694 -0.068047 -0.114218
C  2.958088 -0.131784 -0.249514
H  0.672642 -1.810627 -1.022217
H  0.845703 -1.916709 0.743765
H  -2.682837 -0.293215 -1.008939
H  -1.270454 -0.576943 -2.068858
H  -1.992895 -1.943382 -1.162393
H  -1.744803 -2.096135 1.378909
H  -0.84461 -0.839414 2.284889
H  -2.431563 -0.447319 1.558866
H  1.270196 2.053608 0.045275
H  3.590822 0.761948 -0.257413
H  3.455167 -1.099042 -0.355824
