program: Gaussian 09
title: 000278792
version: EM64L-G09RevD.01
frameworkgroup: C1[X(C24H25NO6S2)]
method: RPBEPBE
basis: SDD
operation: Freq
keyword: #p
keyword: freq=noraman
keyword: PBEPBE/SDD
title: #p freq=noraman PBEPBE/SDD
converged: YES YES NO NO
title: Mulliken charges:
elementType: S S O O O O O O N C C C C C C C C C C C C C C C C C C C C C C C C H H H H H H H H H H H H H H H H H H H H H H H H H
charge: 0.948854 0.360163 -0.510580 -0.506980 -0.242614 -0.261264 -0.259854 -0.283493 -0.392647 -0.347409 0.315108 -0.514419 -0.032438 0.429796 -0.783295 0.354728 -0.221275 -0.275645 0.129429 0.366527 0.461351 -0.400511 -0.349609 -0.382034 -0.411581 -0.801474 -0.238945 -0.229788 -0.247955 -0.263746 -0.261408 -0.661818 -0.659613 0.295940 0.289749 0.283587 0.329967 0.296804 0.241323 0.242954 0.248294 0.243432 0.232444 0.228674 0.242077 0.229220 0.226038 0.230271 0.241013 0.218503 0.230674 0.224714 0.243679 0.240527 0.214260 0.212885 0.231487 0.255922
chargesum: 0.00000
title: Mulliken charges with hydrogens summed into heavy atoms:
elementType: S S O O O O O O N C C C C C C C C C C C C C C C C C C C C C C C C
charge: 0.948854 0.360163 -0.510580 -0.506980 -0.242614 -0.261264 -0.259854 -0.283493 -0.392647 -0.347409 0.315108 0.071269 -0.032438 0.429796 -0.499708 0.354728 0.108692 0.021159 0.129429 0.366527 0.461351 -0.159188 -0.106654 -0.133739 -0.168150 -0.098280 -0.009725 -0.003750 -0.017684 0.195770 0.193981 0.036649 0.040681
polarizability: 3.83344885e+02 1.54724549e+01 3.32982676e+02 2.49873880e+01 -1.20318403e+01 2.93954181e+02
1716.lowfreq: -6.1598 -1.9235 -0.0009 0.0016 0.0017 3.4949 5.3094 11.6057 13.9805
frequency: 3.3073 11.2446 13.6410 21.5685 27.8275 31.9582 37.3142 41.0281 50.7542 57.6526 65.4771 67.8203 86.4855 91.0042 97.0072 101.8578 110.7715 117.9656 127.3018 145.6615 153.9785 164.7862 189.1976 202.1991 207.7109 217.5973 226.0445 228.6667 248.6804 257.9663 278.8292 290.0156 299.0663 313.3958 316.8579 324.3435 345.4673 351.4621 375.3625 402.0017 406.8230 407.7163 409.1665 427.2078 440.9056 469.1673 496.5952 510.2680 524.0404 544.7588 565.8580 584.0346 595.2496 617.2708 620.8139 639.0993 644.7475 661.4524 703.1851 703.9217 718.3674 732.9419 747.0241 773.0885 774.4248 780.3816 791.6308 807.2088 814.4607 815.8869 823.0051 833.6286 849.1232 855.1316 855.8638 874.1526 910.4729 924.6916 945.0059 971.7432 974.5066 977.7476 985.7411 988.6279 992.2460 993.8450 995.5179 996.2224 1010.4367 1024.2892 1035.5598 1048.4977 1049.8299 1081.5170 1094.3540 1096.8341 1099.1705 1122.5684 1146.0086 1157.7149 1158.7590 1172.7947 1190.2747 1191.0731 1196.1438 1212.8978 1218.1922 1244.5828 1274.2357 1276.3559 1304.9173 1312.4663 1317.4926 1337.9270 1354.3668 1355.9236 1370.3755 1382.3124 1385.8817 1391.4482 1393.4323 1393.7847 1399.5556 1405.2723 1433.6486 1457.1039 1459.3435 1459.4096 1462.7910 1463.4064 1471.0584 1473.8620 1475.0642 1484.5376 1486.1952 1498.9978 1535.6230 1584.6926 1591.9922 1593.5573 1601.4909 1613.9760 1653.1451 2981.1364 2992.6115 2994.2261 3009.0483 3029.5127 3031.7916 3062.6117 3082.9645 3087.7905 3090.1798 3092.1418 3094.7191 3095.7081 3120.0969 3121.5665 3121.8789 3126.3585 3132.6502 3135.3339 3138.6643 3147.9234 3148.5713 3164.1394 3166.4904 3224.2506
redmass: 5.7063 4.4500 5.0373 4.3633 1.2885 2.6357 3.8261 4.3765 3.8786 3.4397 4.5355 3.3567 5.5835 4.4495 6.0316 5.6675 6.2935 4.5111 6.8500 7.5243 5.4136 4.0544 3.8561 6.1750 2.2080 1.7915 5.5393 2.1823 3.0340 3.5701 5.6799 4.2579 3.0096 4.7890 4.9520 4.4352 7.8790 5.7074 3.6435 4.6272 2.9442 3.0656 5.0705 3.9674 6.9346 5.3477 3.7427 3.9606 4.2889 4.6888 4.9805 6.2812 6.7299 6.5419 6.9228 6.3176 6.7874 5.4366 2.0215 3.3191 4.3966 2.9985 1.4763 4.6550 2.3874 4.4752 1.5969 3.4084 8.2363 1.5327 2.5951 1.3552 4.2873 1.2511 1.2580 4.0965 3.6989 1.5199 14.1155 1.7337 1.7913 1.4239 2.4331 5.4302 1.9449 1.4895 1.3828 2.7338 2.8174 2.9095 3.0629 2.4260 1.5975 1.6053 2.4520 2.1504 2.6928 1.3052 3.8790 1.6802 1.7112 1.0549 1.2325 1.1367 2.0673 1.8558 3.0521 1.4754 1.1218 1.1177 1.2696 1.5205 2.9894 1.3266 1.4150 1.3771 4.6303 6.4006 5.3431 1.2364 1.2803 2.2953 1.3100 1.1853 2.3752 1.2239 2.4551 1.0882 1.0564 1.0478 1.0864 2.2181 1.0817 1.0531 1.0534 3.9624 8.1466 6.1300 6.2560 6.4865 9.7256 6.1735 9.3079 1.0383 1.0364 1.0363 1.0613 1.0595 1.0598 1.0958 1.0987 1.0973 1.0973 1.0997 1.1034 1.1032 1.1057 1.1059 1.0849 1.0875 1.0891 1.0899 1.0922 1.0966 1.0978 1.1017 1.0956 1.0948
irintensity: 0.1726 0.7310 0.3376 1.1342 0.2196 0.8851 0.2776 0.1683 0.1577 0.1325 0.6473 1.5921 0.9865 0.2153 2.4116 2.7797 1.8684 1.1276 3.3077 0.5906 2.0617 0.7487 0.4582 7.1221 3.9013 0.3599 6.0888 9.3005 0.0591 2.6750 5.6098 5.5128 13.0055 7.8297 2.7444 10.5974 11.0738 1.3426 0.3211 17.9725 1.4245 1.5338 16.9202 1.4476 69.9479 10.5223 26.5934 80.4046 18.2016 13.1709 8.5828 35.6264 0.9363 1.2744 2.1974 18.0700 3.8042 14.4516 36.6221 2.9723 30.0096 20.6546 57.2481 14.7010 16.0574 19.4119 6.7066 3.5145 132.4326 1.6318 6.6658 34.1660 20.1624 0.8660 1.0860 17.2185 18.8799 0.8972 78.1712 5.4793 22.6361 0.1509 3.6648 0.1828 3.8260 1.7291 2.0064 8.5112 17.8180 51.2627 86.8328 21.5712 13.1944 11.1597 64.7615 39.2351 57.1476 2.6995 466.8331 24.6319 44.2398 0.2255 23.0252 2.2455 94.7293 14.0376 3.2094 56.4419 4.7933 2.5402 4.9475 11.4411 83.8569 11.1295 14.4585 5.9742 3.2469 3.4059 11.7656 20.5093 21.7223 13.3024 15.4871 28.7673 3.4355 20.2663 5.6256 16.1923 5.9985 15.2919 18.1041 28.0722 13.7721 12.0881 25.0778 84.7979 17.1136 5.8448 5.6864 9.9583 158.0044 15.6175 190.3958 23.7747 19.5776 21.1072 6.8303 21.7307 29.7248 19.3805 3.4350 32.5369 34.2716 14.8598 1.5124 0.5284 22.5334 37.4484 5.5900 0.0862 36.0746 2.7268 17.0451 30.4547 42.8193 26.1158 9.2329 0.8071
temp: 298.150 k
press: 1.00000 atm
elementType: 16 16 8 8 8 8 8 8 7 6 6 6 6 6 6 6 6 6 6 6 6 6 6 6 6 6 6 6 6 6 6 6 6 1 1 1 1 1 1 1 1 1 1 1 1 1 1 1 1 1 1 1 1 1 1 1 1 1
symmnumber: 1
zpe: 1151858.8 jmol-1
zpe.correction: 0.438720 hartree
zpe.thermalcorrener: 0.473457 hartree
zpe.thermalcorrenthalpy: 0.474401 hartree
zpe.thermalcorrgfe: 0.364469 hartree
zpe.sumelectzpe: -2229.184493 hartree
zpe.sumelectthermal: -2229.149757 hartree
zpe.sumelectthermalent: -2229.148813 hartree
zpe.sumelectthermalfe: -2229.258744 hartree
dipole: 3.8780 0.0372 5.7876
dipole: 6.9668
quadrupole: -206.3802 -181.8603 -200.3449
quadrupole: 11.8284 -8.6795 4.4275
quadrupole: -10.1851 14.3349 -4.1498 11.8284 -8.6795 4.4275
hfenergy: -2229.6232133 hartree
pointgroup: C01 [X(C24H25N1O6S2)]
dipole: -1.8583504 0.7147992 -1.8837142 debye
polarizability: 390.3711785|10.1394355|297.0130194|5.0472777|23.7813593|322.8975443 unknown
InChI: InChI=1S/C24H25NO6S2/c1-4-30-21(26)15-25(33(28,29)19-13-11-17(3)12-14-19)23-22(24(27)31-5-2)20(16-32-23)18-9-7-6-8-10-18/h6-14,16H,4-5,15H2,1-3H3
charge 0 multiplicity 1
58 atoms
S  2.284261 1.111044 2.179808
S  -0.286813 -1.072834 3.274326
O  3.788067 1.274665 1.586393
O  2.073017 0.968195 3.785612
O  -1.30029 -0.188001 -1.440355
O  4.137675 -1.318435 -1.265342
O  0.460401 -1.716945 -1.467691
O  2.617341 0.447619 -1.262721
N  1.649769 -0.475953 1.32712
C  0.347428 -0.8675 1.552577
C  -0.665091 -1.175419 0.630226
C  2.684273 -1.2139 0.603815
C  1.095673 2.450516 1.582588
C  -1.925426 -1.573182 1.231754
C  -1.880041 -1.527511 2.62058
C  -3.134229 -2.019414 0.488783
C  1.083331 2.792138 0.22193
C  0.303423 3.073778 2.560473
C  -0.4277 -1.084095 -0.840677
C  3.102331 -0.572297 -0.726935
C  -0.610559 4.505832 0.771498
C  0.214609 3.835145 -0.169832
C  -0.553189 4.111401 2.135347
C  -3.03237 -2.959653 -0.572004
C  -4.422733 -1.551439 0.86093
C  -1.5547 5.608943 0.330153
C  -4.187015 -3.414283 -1.244032
C  -5.578221 -2.009912 0.191896
C  -5.465842 -2.942982 -0.865098
C  -1.145925 0.005565 -2.91955
C  4.734823 -0.818624 -2.544631
C  -1.879701 -1.087578 -3.700538
C  5.819817 0.221057 -2.252624
H  2.287434 -2.21948 0.381833
H  3.597514 -1.33316 1.21616
H  -2.687423 -1.762816 3.312513
H  1.702247 2.247978 -0.499636
H  0.36631 2.758002 3.606429
H  0.177925 4.12782 -1.225335
H  -1.182841 4.621633 2.873427
H  -2.049026 -3.353517 -0.854824
H  -4.511812 -0.807653 1.661121
H  -1.551429 6.453022 1.042675
H  -1.285889 6.000181 -0.665631
H  -2.59513 5.235399 0.27142
H  -4.08962 -4.144749 -2.055119
H  -6.563625 -1.633681 0.489069
H  -6.362038 -3.298515 -1.385583
H  -0.067005 0.022896 -3.153496
H  -1.589191 1.000437 -3.084966
H  3.923906 -0.398925 -3.165321
H  5.141191 -1.728992 -3.012831
H  -1.397877 -2.067971 -3.550737
H  -2.934162 -1.156188 -3.383399
H  -1.853354 -0.850014 -4.780523
H  6.292594 0.542497 -3.19942
H  6.602952 -0.199811 -1.599253
H  5.389259 1.10857 -1.759742
