program: Gaussian 09
title: 000281492
version: EM64L-G09RevD.01
frameworkgroup: C1[X(C8H12N2O)]
method: RPBEPBE
basis: SDD
operation: Freq
keyword: #p
keyword: freq=noraman
keyword: PBEPBE/SDD
title: #p freq=noraman PBEPBE/SDD
converged: YES YES NO NO
title: Mulliken charges:
elementType: O N N C C C C C C C C H H H H H H H H H H H H
charge: -0.238148 -0.400528 -0.002073 0.205004 -0.546896 0.324722 0.125683 -0.714788 -0.732264 -0.717569 -0.196450 0.240809 0.245823 0.322217 0.243284 0.215311 0.241822 0.215874 0.213004 0.246949 0.232758 0.238372 0.237082
chargesum: 0.00000
title: Mulliken charges with hydrogens summed into heavy atoms:
elementType: O N N C C C C C C C C
charge: -0.238148 -0.078311 -0.002073 0.205004 -0.060264 0.324722 0.125683 -0.014371 -0.056436 -0.009356 -0.196450
polarizability: 1.12719181e+02 4.18219759e+00 8.99603693e+01 6.61078044e-01 -1.17724456e+00 8.43270762e+01
1716.lowfreq: -2.6371 -0.0005 0.0004 0.0005 11.9478 20.7714 75.7675 80.9206 158.0301
frequency: 75.6293 80.8725 158.0102 185.7551 189.8079 215.7362 228.4329 238.6308 279.8307 283.1846 333.8332 349.4670 406.7178 459.5855 483.4871 575.2984 585.7008 601.7355 611.6166 705.2230 718.9864 769.1648 851.3432 897.0555 932.4716 950.4445 960.1084 979.0807 1008.1076 1072.9040 1110.4122 1141.4543 1195.5874 1201.2399 1228.4034 1239.3955 1277.7620 1318.6502 1364.2723 1377.1962 1392.4749 1397.0753 1455.8944 1464.8140 1467.0842 1469.5610 1477.0451 1479.3074 1488.1686 1664.3337 2176.6083 2980.5910 2982.8355 2992.9114 3017.9235 3075.3599 3080.0630 3087.2665 3092.2389 3093.4941 3095.6708 3105.3203 3551.8194
redmass: 4.0622 7.2951 3.7669 1.4209 2.1040 2.1430 1.3981 1.1821 2.1973 2.4113 2.6371 2.8023 2.5632 4.0672 4.8334 1.9951 3.8400 2.2076 4.6078 4.3910 6.5495 3.5274 2.4637 2.2847 1.6975 1.4716 1.7239 1.6752 1.3554 1.6295 2.5478 3.2758 3.5099 2.9673 2.1315 2.4498 1.9428 1.9982 1.7322 1.1892 1.2138 1.2062 1.0620 1.0563 1.0584 1.0525 1.0554 1.0597 1.0598 8.7443 12.6617 1.0350 1.0355 1.0349 1.0620 1.1006 1.1000 1.1014 1.1018 1.0996 1.1010 1.1011 1.0786
irintensity: 2.8765 3.9976 2.3388 0.3908 0.7845 1.9116 0.0859 1.9448 0.3976 3.8649 1.2137 0.5849 1.8141 2.9745 3.8346 44.6526 7.1484 52.8681 35.8482 3.6446 16.1905 3.7948 6.0556 2.6513 3.6066 2.3863 4.8918 1.1767 0.7006 4.4906 12.2322 20.5609 26.6821 32.6804 6.2675 89.8005 45.2002 9.8652 45.4604 14.9302 5.8998 30.8156 4.0047 2.5121 12.4740 8.7318 7.7792 11.3674 13.7165 337.6532 3.5067 25.8605 19.6692 13.0237 19.8636 14.9234 33.0976 5.0486 15.6120 30.4913 14.5714 20.2299 25.9055
temp: 298.150 k
press: 1.00000 atm
elementType: 8 7 7 6 6 6 6 6 6 6 6 1 1 1 1 1 1 1 1 1 1 1 1
symmnumber: 1
zpe: 494838.0 jmol-1
zpe.correction: 0.188474 hartree
zpe.thermalcorrener: 0.200152 hartree
zpe.thermalcorrenthalpy: 0.201096 hartree
zpe.thermalcorrgfe: 0.151875 hartree
zpe.sumelectzpe: -495.939698 hartree
zpe.sumelectthermal: -495.928020 hartree
zpe.sumelectthermalent: -495.927075 hartree
zpe.sumelectthermalfe: -495.976297 hartree
dipole: 0.8624 -1.7626 3.7289
dipole: 4.2137
quadrupole: -75.2596 -68.7372 -67.8638
quadrupole: -13.4762 -3.1477 0.7429
quadrupole: -4.6394 1.8830 2.7564 -13.4762 -3.1477 0.7429
hfenergy: -496.1281716 hartree
pointgroup: C01 [X(C8H12N2O1)]
dipole: 0.2678969 0.6699094 -1.4925533 debye
dipolederiv: -0.9641799 0.0418189 0.269057 0.1175957 -0.4483882 -0.1980205 0.4469309 -0.1847734 -0.722849 -1.1485055 -0.0351873 0.2042691 -0.2841289 -0.5195557 0.1800559 0.0866418 0.0695782 -0.4217771 -0.2838308 0.025267 -0.0177084 0.0722109 -0.2216753 0.0019547 -0.0692107 0.0147012 -0.1955652 0.0986415 -0.0114261 0.0090261 -0.0254791 -0.0711228 -0.171725 -0.0330932 -0.1829493 -0.0816645 -0.0146365 -0.0722485 -0.0227909 0.0117512 0.0080575 0.0080581 0.0410964 0.0337917 0.0652425 0.5126084 -0.0946219 -0.11981 -0.2192917 0.4465612 -0.0193235 -0.3340169 -0.0251414 0.4560045 1.6265017 0.1387019 -0.4395242 0.3483833 0.465963 0.2993111 -0.3113845 0.4035429 0.6792759 0.0011269 0.0203524 -0.0044799 0.0066154 0.0222781 0.0639077 -0.0127164 0.0012766 -0.0049436 -0.0312896 0.0249795 0.0085049 -0.0099825 0.0542558 0.0129128 0.0090855 0.0242869 0.047517 -0.0537072 0.0367219 0.0160952 -0.0019412 -0.0164605 0.0603588 0.0431794 0.0279959 0.0289267 -0.044123 -0.0667241 0.0898138 -0.0757131 -0.0690523 -0.0620822 0.1181664 -0.0129449 -0.1313304 0.0359452 0.0256102 -0.0449872 0.0005979 -0.0310412 0.1197353 -0.0164738 0.0912359 -0.0340394 0.0356401 0.0478655 0.0496524 0.0652816 -0.0335481 -0.0923481 0.0305202 -0.061528 0.047259 0.1101588 -0.0538637 0.0130959 -0.0169221 0.2874548 -0.0914932 0.0146496 -0.0894931 0.202537 -0.0436704 -0.0566148 0.1072719 -0.0008189 0.0745281 0.0068611 0.1037192 0.0406786 0.026203 0.0911782 -0.0215961 -0.0135392 -0.029812 -0.0493685 -0.0891128 -0.0257681 -0.1274769 -0.0530468 -0.062171 0.0592932 -0.101914 0.0332845 0.0634447 0.0214182 -0.0947821 0.027115 0.0373833 0.0748525 -0.0260951 -0.0002547 0.0240818 -0.120271 0.1088834 -0.0239634 0.0844303 0.0410517 0.0694339 0.0099855 -0.0145088 -0.0255728 -0.0209403 -0.1357558 -0.0602555 -0.1090419 -0.0515103 -0.0529116 -0.0266912 0.0494249 -0.0186176 0.1019673 0.0226051 0.1227459 0.025975 0.0293774 0.0061558 -0.075706 -0.0661621 -0.0833168 0.0462704 -0.026825 -0.1041243 -0.0745654 -0.0128779 0.0264347 0.0193593 0.0782782 0.0408518 0.0470337 -0.0833809 0.1146175 -0.0402066 -0.0178695 0.0103479 0.0908195 -0.0488101 0.0709425 -0.0163907 0.0640049 -0.0455641 0.0635128 0.0666956 unknown
polarizability: 113.3598159|-1.6204786|89.2212094|-0.3405964|-1.4364709|84.4256015 unknown
InChI: InChI=1S/C8H12N2O/c1-7(2)4-8(3,5-9)10-6(7)11/h10H,4H2,1-3H3
charge 0 multiplicity 1
23 atoms
O  -1.998672 0.845861 1.563966
N  0.201872 1.053634 0.752074
N  2.762257 -1.319531 0.760992
C  -1.21056 -0.449257 -0.44486
C  0.066481 -0.14343 -1.282016
C  1.098616 0.513492 -0.29006
C  -1.097186 0.546102 0.739756
C  -1.200718 -1.891671 0.13817
C  -2.517282 -0.199336 -1.228386
C  1.953673 1.617628 -0.958738
C  2.015929 -0.514467 0.292604
H  -0.161559 0.602317 -2.064909
H  0.485809 -1.039253 -1.76801
H  0.536899 1.652727 1.509466
H  -2.045696 -2.023726 0.836355
H  -1.302881 -2.629262 -0.678911
H  -0.265954 -2.111564 0.684554
H  -2.547411 0.821641 -1.650816
H  -2.617941 -0.923241 -2.057827
H  -3.385319 -0.3113 -0.555668
H  2.656737 2.074193 -0.239881
H  2.541795 1.194716 -1.791429
H  1.286113 2.402728 -1.353225
