program: Gaussian 09
title: 000281511
version: EM64L-G09RevD.01
frameworkgroup: C1[X(C12H17NO3)]
method: RPBEPBE
basis: SDD
operation: Freq
keyword: #p
keyword: freq=noraman
keyword: PBEPBE/SDD
title: #p freq=noraman PBEPBE/SDD
converged: NO YES NO NO
title: Mulliken charges:
elementType: O O O N C C C C C C C C C C C C H H H H H H H H H H H H H H H H H
charge: -0.211041 -0.240508 -0.253405 0.002370 -0.410125 -0.372677 -0.423160 -0.403265 -0.514662 -0.524092 0.172135 0.254092 -0.128904 0.213942 -0.257518 -0.665651 0.213278 0.208468 0.191349 0.206216 0.229413 0.209440 0.212402 0.220452 0.248469 0.201371 0.220995 0.237432 0.231960 0.230702 0.218336 0.234199 0.247985
chargesum: 0.00000
title: Mulliken charges with hydrogens summed into heavy atoms:
elementType: O O O N C C C C C C C C C C C C
charge: -0.211041 -0.240508 -0.253405 0.002370 0.011622 0.024888 0.015693 0.029589 -0.064822 -0.065665 0.172135 0.254092 -0.128904 0.213942 0.205144 0.034869
polarizability: 1.91046614e+02 -4.74585686e+00 1.37271458e+02 6.85862412e+00 4.78824302e+00 1.03152388e+02
1716.lowfreq: -18.2378 -9.1985 -5.4316 -0.0008 -0.0004 0.0001 20.6482 42.0027 72.8857
frequency: 20.3091 41.6242 72.8767 80.5583 103.6019 105.9659 149.1091 197.0187 204.2999 226.9943 243.6379 276.7953 306.6531 321.5262 342.0884 364.5532 391.3121 430.0311 451.3416 477.1398 520.2005 599.3092 610.9307 683.6896 690.8300 734.2411 737.4759 759.0122 787.5798 814.2937 821.4220 826.1273 848.9861 859.9260 880.0018 925.7828 955.1646 990.6164 995.2817 1025.5892 1045.6863 1061.1562 1087.2944 1095.0554 1128.6422 1131.7871 1156.9475 1168.0168 1196.3368 1213.2845 1240.3298 1251.4670 1271.5580 1277.8577 1280.4453 1314.7341 1320.5940 1334.2893 1340.6133 1346.2797 1348.6618 1359.4978 1378.8109 1390.5233 1445.5408 1453.7281 1458.0627 1461.1325 1462.6659 1463.9527 1468.6664 1474.0363 1479.1749 1485.0188 1597.4144 1612.9070 2967.3303 2975.6171 2977.9931 2981.4749 2983.0584 2990.9503 2994.3463 3019.6817 3031.3973 3033.0943 3038.6125 3045.5424 3056.1376 3077.0067 3089.7948 3096.5643 3122.5976
redmass: 4.4957 3.5810 4.4002 4.1029 2.9794 4.3686 2.5753 2.9781 1.6930 1.6612 2.9421 3.9168 2.7645 1.9427 3.9243 3.5936 3.2776 3.4173 1.9984 3.8727 3.7997 7.4831 4.3091 3.4315 3.6922 2.1423 2.8776 3.5802 3.3755 1.5364 2.2922 2.8433 6.4770 2.4345 1.9957 2.8260 2.2457 2.1863 2.5200 3.0909 1.9341 2.4688 2.3557 2.1640 3.4329 1.9836 1.6894 1.3286 1.4320 1.5045 1.4176 2.1545 1.3090 1.1220 1.1737 1.3560 1.3546 1.3423 1.7902 1.4020 1.4759 1.3771 3.0443 1.2440 1.9070 1.2009 1.1038 1.2893 1.0651 1.1791 1.1773 1.1000 1.0877 1.0569 9.1592 9.1087 1.0615 1.0612 1.0615 1.0641 1.0642 1.0664 1.0361 1.0993 1.0601 1.0968 1.1005 1.1009 1.0987 1.0965 1.0974 1.1026 1.1062
irintensity: 2.0857 1.0897 0.7040 1.7214 0.9699 0.3448 2.7287 0.3761 0.8162 2.9127 0.3651 0.4123 15.2152 1.1409 7.4592 0.5723 1.5732 3.6880 0.7309 0.4808 0.7740 3.8476 3.1086 2.1395 7.5474 9.8920 14.0927 4.0081 5.3627 14.6731 0.4995 4.4993 20.2583 6.1869 6.3889 23.4493 1.4330 0.1233 4.2852 105.1821 9.2885 23.7865 116.8283 14.1889 129.8818 24.6678 38.7048 30.7376 30.2308 8.0278 9.0623 55.5979 3.6271 9.3889 11.8717 1.8924 5.0056 0.2009 26.8325 6.1449 13.1262 11.9469 83.5494 20.1958 5.9209 10.0961 20.9045 14.8859 12.8777 2.9082 9.1926 9.4156 35.2797 14.0239 90.4944 70.7147 27.5674 24.4209 26.7058 59.0758 3.3821 17.0034 20.3462 34.7545 28.1858 75.8064 20.7240 84.6903 21.4238 9.2711 34.8546 1.7890 29.7321
temp: 298.150 k
press: 1.00000 atm
elementType: 8 8 8 7 6 6 6 6 6 6 6 6 6 6 6 6 1 1 1 1 1 1 1 1 1 1 1 1 1 1 1 1 1
symmnumber: 1
zpe: 717503.8 jmol-1
zpe.correction: 0.273283 hartree
zpe.thermalcorrener: 0.288908 hartree
zpe.thermalcorrenthalpy: 0.289852 hartree
zpe.thermalcorrgfe: 0.229256 hartree
zpe.sumelectzpe: -746.630663 hartree
zpe.sumelectthermal: -746.615038 hartree
zpe.sumelectthermalent: -746.614094 hartree
zpe.sumelectthermalfe: -746.674690 hartree
dipole: 1.4993 1.8973 0.8903
dipole: 2.5769
quadrupole: -72.6527 -105.2976 -93.9178
quadrupole: -2.3420 2.6507 -3.7725
quadrupole: 17.9700 -14.6749 -3.2951 -2.3420 2.6507 -3.7725
hfenergy: -746.903946 hartree
pointgroup: C01 [X(C12H17N1O3)]
dipole: 0.5849178 0.6715315 0.484507 debye
polarizability: 190.3816222|-6.9386918|135.058661|8.8583858|9.6442759|106.030177 unknown
InChI: InChI=1S/C12H17NO3/c1-2-15-12(14)11-9-7-5-3-4-6-8-10(9)16-13-11/h2-8H2,1H3
charge 0 multiplicity 1
33 atoms
O  0.679175 -2.229539 -0.743963
O  -3.042818 -0.407252 -0.929571
O  -2.05325 1.402634 0.16577
N  -0.686516 -1.774435 -0.974396
C  2.60341 1.608751 -0.829997
C  3.800362 0.837934 -0.18809
C  1.509987 2.112193 0.147562
C  3.825008 -0.696178 -0.433475
C  0.893802 1.02194 1.075804
C  2.79185 -1.540275 0.374325
C  0.502906 -0.220866 0.32206
C  1.358575 -1.273816 0.032428
C  -0.740547 -0.574567 -0.323481
C  -1.981628 0.244937 -0.324065
C  -4.342887 0.335336 -0.975415
C  -5.137257 0.112245 0.314427
H  2.136462 0.968631 -1.603904
H  2.990557 2.494589 -1.370331
H  3.840778 1.036825 0.903031
H  4.745146 1.244098 -0.599106
H  0.693721 2.575817 -0.439458
H  1.929476 2.908654 0.794158
H  4.829274 -1.081797 -0.166417
H  3.687491 -0.895302 -1.514357
H  0.016792 1.451748 1.587725
H  1.634428 0.744983 1.851489
H  2.940458 -1.338755 1.453908
H  2.997228 -2.614369 0.212307
H  -4.13237 1.406659 -1.140373
H  -4.847706 -0.096628 -1.853611
H  -6.13428 0.581722 0.221762
H  -5.279195 -0.965137 0.505527
H  -4.622432 0.565522 1.177926
